program: Gaussian 09
title: 000251745
version: EM64L-G09RevD.01
frameworkgroup: C1[X(C14H15NO2S2)]
method: RPBEPBE
basis: SDD
operation: Freq
keyword: #p
keyword: freq=noraman
keyword: PBEPBE/SDD
title: #p freq=noraman PBEPBE/SDD
converged: YES YES NO NO
title: Mulliken charges:
elementType: S S O O N C C C C C C C C C C C C C C H H H H H H H H H H H H H H H
charge: 0.878399 0.486590 -0.561523 -0.560307 -0.539455 -0.027390 -0.241277 -0.234884 0.452158 -0.064591 -0.366082 -0.364127 -0.785409 -0.253941 -0.248509 -0.801186 -0.229026 -0.208608 -0.222391 0.275662 0.281119 0.239401 0.240141 0.333340 0.257506 0.275381 0.326802 0.247370 0.228927 0.228043 0.241593 0.243797 0.236802 0.235674
chargesum: 0.00000
title: Mulliken charges with hydrogens summed into heavy atoms:
elementType: S S O O N C C C C C C C C C C C C C C
charge: 0.878399 0.486590 -0.561523 -0.560307 -0.539455 -0.027390 0.034385 0.046235 0.452158 -0.064591 -0.126680 -0.123987 0.080817 0.072862 -0.001138 -0.102624 0.014771 0.028195 0.013282
polarizability: 3.40245223e+02 1.57029234e+00 1.99066675e+02 -2.43465815e+00 -2.51047776e+00 1.28503591e+02
1716.lowfreq: -19.9620 -12.7687 -6.6223 -3.2816 -0.0025 -0.0010 -0.0006 13.6735 29.3083
frequency: -19.6310 10.8324 29.1176 39.1971 44.6804 76.9945 99.0130 114.6185 129.0947 139.1304 156.6939 164.7128 185.2961 229.3205 242.6302 279.1793 282.1016 317.5060 323.4834 366.3184 377.5055 389.4356 402.7976 407.0375 460.2161 480.4109 495.0232 530.2501 557.2628 593.6925 603.5753 622.6144 624.9746 650.2796 695.9722 709.6033 755.8960 773.1264 790.5129 827.4458 848.9737 858.3495 890.4609 939.4018 960.5920 976.6365 979.6028 983.5098 988.6311 989.9825 990.9596 996.6104 1008.2304 1017.3474 1048.9073 1052.7498 1058.6798 1087.0705 1117.4961 1174.6925 1183.3591 1202.2892 1218.4225 1295.6593 1324.9579 1328.9950 1378.0841 1382.0737 1392.1564 1398.2722 1407.8691 1430.2977 1440.0159 1467.3094 1471.1699 1473.3365 1474.6706 1579.4468 1593.7126 1596.5743 1597.8863 2979.5786 3019.3140 3062.0635 3062.9275 3090.9328 3126.7122 3133.4220 3135.5812 3138.3075 3153.5348 3162.9526 3165.4806 3166.1512 3168.5830 3169.8230
redmass: 1.0542 5.7255 3.4917 4.8518 4.8260 6.1866 4.8626 2.5367 4.3117 1.8518 5.7737 3.3554 3.5816 7.5340 4.2839 6.2250 6.2543 5.5017 6.2025 5.7302 9.0583 5.4008 2.9787 2.8613 5.7994 3.5701 6.0702 5.1328 7.5070 6.2213 6.7021 6.9644 14.1043 6.9708 2.5429 3.2612 1.3790 6.7875 7.6661 1.3811 1.2511 1.2436 15.8559 1.3361 1.3126 4.1492 1.4027 1.3803 1.2486 1.3864 1.3544 5.1016 4.4574 1.3444 1.5914 2.0037 2.5137 1.6581 1.2811 1.0568 1.1431 1.1507 2.9806 1.2640 1.1276 1.2985 8.0120 6.0118 3.0484 1.2221 1.0541 2.1173 1.0599 1.8690 1.0981 1.0763 2.3074 5.5295 6.1254 6.9218 6.1418 1.0388 1.0255 1.0949 1.0980 1.1000 1.0871 1.0893 1.0895 1.0893 1.0948 1.0952 1.1069 1.0965 1.1009 1.1074
irintensity: 0.4845 2.7474 0.0826 2.1414 1.5995 1.1268 0.7730 0.6677 4.2495 1.1321 2.3620 2.4769 0.4655 20.7530 6.0767 10.4306 12.2153 5.3565 3.9172 14.1770 4.0930 9.5908 0.1776 0.0311 88.6521 10.9621 44.8749 75.3111 5.6218 35.5717 6.9858 0.3671 101.4327 0.4662 26.0063 0.4771 74.5571 33.0257 54.5785 34.6123 1.4686 0.9582 93.3048 3.7199 0.6877 22.4461 0.3642 36.8232 4.7624 0.7260 6.4803 2.8308 4.2529 3.9223 24.6458 3.3399 30.4470 4.5224 8.0153 0.5990 17.8159 4.8758 7.1841 2.2760 7.9900 0.7545 1.5719 0.1588 9.4504 14.1439 16.1466 15.6234 28.4492 27.4001 16.0149 14.0305 24.1478 10.8036 4.4027 0.5428 9.9184 31.5922 13.4262 21.4378 119.6888 15.7665 0.6860 15.8211 12.6073 1.9609 16.5788 1.8873 2.0620 10.9011 36.5339 3.1949
temp: 298.150 k
press: 1.00000 atm
elementType: 16 16 8 8 7 6 6 6 6 6 6 6 6 6 6 6 6 6 6 1 1 1 1 1 1 1 1 1 1 1 1 1 1 1
symmnumber: 1
zpe: 665831.7 jmol-1
zpe.correction: 0.253602 hartree
zpe.thermalcorrener: 0.272991 hartree
zpe.thermalcorrenthalpy: 0.273935 hartree
zpe.thermalcorrgfe: 0.203284 hartree
zpe.sumelectzpe: -1542.177057 hartree
zpe.sumelectthermal: -1542.157668 hartree
zpe.sumelectthermalent: -1542.156724 hartree
zpe.sumelectthermalfe: -1542.227375 hartree
dipole: -1.4024 1.5985 -2.4543
dipole: 3.2474
quadrupole: -79.1457 -115.9684 -140.5170
quadrupole: -3.9248 -1.8973 -0.1402
quadrupole: 32.7314 -4.0914 -28.6400 -3.9248 -1.8973 -0.1402
hfenergy: -1542.4306592 hartree
pointgroup: C01 [X(C14H15N1O2S2)]
dipole: 0.5948068 -0.3874401 1.0622713 debye
polarizability: 339.6381715|8.0576656|151.1289358|-8.3782884|32.607528|177.0483806 unknown
InChI: InChI=1S/C14H15NO2S2/c1-12-8-10-14(11-9-12)19(16,17)15-18(2)13-6-4-3-5-7-13/h3-11H,1-2H3
charge 0 multiplicity 1
34 atoms
S  -0.441009 0.438108 -0.526493
S  1.930094 -0.074453 1.436801
O  0.035835 -0.100257 -2.005449
O  -0.362049 2.058772 -0.254166
N  0.293589 -0.552571 0.91529
C  -2.214662 -0.13249 -0.278814
C  -3.035028 0.605453 0.58821
C  -2.658907 -1.256709 -0.991434
C  -4.873408 -0.949909 0.05221
C  3.31228 -0.404776 0.166238
C  -4.373574 0.184565 0.745621
C  -4.00093 -1.659698 -0.814856
C  2.098791 1.841714 1.574789
C  3.048281 -0.548962 -1.207874
C  4.604955 -0.549162 0.71515
C  -6.322227 -1.375054 0.209388
C  4.142775 -0.8264 -2.06368
C  5.683954 -0.821147 -0.15723
C  5.451798 -0.957201 -1.546179
H  -2.642534 1.487522 1.103885
H  -1.98039 -1.781753 -1.671028
H  -5.037033 0.742288 1.416752
H  -4.373943 -2.536552 -1.356693
H  1.748106 2.291451 0.63611
H  3.16216 2.031575 1.784143
H  1.452517 2.134963 2.41377
H  2.031387 -0.454613 -1.616019
H  4.774826 -0.466891 1.795176
H  -6.441861 -2.464739 0.079586
H  -6.719753 -1.101242 1.202119
H  -6.961145 -0.881684 -0.548607
H  3.961068 -0.938509 -3.137814
H  6.694313 -0.934917 0.249956
H  6.288023 -1.172425 -2.220356
