program: Gaussian 09
title: 000251723
version: EM64L-G09RevD.01
frameworkgroup: C1[X(C16H16O4)]
method: RPBEPBE
basis: SDD
operation: Freq
keyword: #pfreq=noraman
keyword: PBEPBE/SDD
title: #p freq=noraman PBEPBE/SDD
converged: YES YES NO NO
title: Mulliken charges:
elementType: O O O O C C C C C C C C C C C C C C C C H H H H H H H H H H H H H H H H
charge: -0.249830 -0.218622 -0.294581 -0.183042 -0.596668 -0.087736 0.351543 0.130174 0.364117 0.394997 -0.551180 -0.364485 -0.450548 -0.404934 -0.409370 0.210430 -0.240904 -0.233479 -0.517002 -0.510439 0.255250 0.246602 0.227970 0.284328 0.243684 0.237984 0.247722 0.240599 0.232531 0.230877 0.240893 0.192968 0.249846 0.250655 0.230952 0.248698
chargesum: 0.00000
title: Mulliken charges with hydrogens summed into heavy atoms:
elementType: O O O O C C C C C C C C C C C C C C C C
charge: -0.249830 -0.218622 -0.294581 -0.183042 -0.094816 0.140234 0.351543 0.130174 0.364117 0.394997 -0.266852 -0.120801 -0.212564 -0.157213 -0.168771 0.210430 -0.008373 -0.002602 0.166705 0.219866
polarizability: 2.73029195e+02 -2.00637837e+01 1.85643794e+02 -3.35465606e+01 -2.12729208e+01 1.21610276e+02
1716.lowfreq: -12.7127 -0.0008 -0.0007 -0.0005 2.9828 6.7618 20.5183 24.1173 50.5429
frequency: 20.2919 24.0770 50.4785 55.0888 90.7950 102.4852 115.1473 121.6466 137.8782 158.6058 167.1245 189.8171 216.1959 229.0776 243.2198 283.2421 340.8959 350.6427 355.2024 378.3552 399.1437 459.9650 480.9823 494.9980 506.9526 513.8822 533.6181 602.9104 622.7548 637.9597 655.3940 691.8841 751.3322 759.3013 780.4436 793.3145 816.7757 820.2285 834.3793 879.2421 889.8942 928.9110 939.2616 949.4465 966.1106 970.4393 981.7858 997.0855 1005.8539 1021.2676 1041.9445 1072.1061 1109.2292 1115.9482 1123.1972 1129.2981 1148.0806 1154.5640 1161.2683 1173.5126 1175.4350 1212.4590 1227.0901 1246.6869 1275.2794 1289.3194 1330.5690 1339.5622 1355.0612 1410.6462 1421.7566 1423.4833 1434.0369 1435.6260 1453.1978 1453.3416 1456.3214 1466.2203 1467.8526 1489.5373 1513.4512 1556.6457 1583.2248 1602.5745 1638.4078 1678.4649 2930.2152 2938.1821 3001.9766 3029.0735 3041.6509 3089.9730 3104.0173 3114.7158 3122.0525 3123.9314 3130.6387 3143.2593 3146.2247 3147.0419 3159.0813 3165.0016
redmass: 5.8412 4.9728 5.6843 5.6114 5.1347 4.0517 2.8882 1.1551 4.1823 3.9215 3.0334 3.7351 2.4191 2.0412 4.6138 4.3833 5.4033 4.5077 3.4087 4.1113 3.4276 4.1056 2.6129 3.6502 4.4759 6.6606 4.4033 6.0561 5.1492 3.7539 5.1493 3.9364 1.5670 4.7696 2.4401 2.8524 4.4005 4.4629 1.5238 2.2289 2.5588 3.6376 4.5449 1.4809 4.1175 1.6000 1.4394 1.3620 3.3851 2.3708 2.5679 3.1453 3.3028 1.3209 1.3293 1.6994 1.3762 1.3692 1.5797 1.1496 1.1427 1.4585 1.6404 1.6241 1.7077 2.0560 1.4278 1.5868 1.8327 5.5317 1.1844 2.8351 1.2542 3.4949 1.2102 1.1280 1.0992 1.0620 1.6373 1.0668 3.4426 7.7113 7.8128 5.7639 6.9125 10.6862 1.0813 1.0383 1.0296 1.0597 1.0969 1.1031 1.1043 1.0996 1.0882 1.0869 1.0887 1.0917 1.0951 1.1049 1.0946 1.1004
irintensity: 1.0625 1.4123 0.2573 0.9223 0.5558 8.0409 3.5767 0.7934 4.1411 2.6596 5.6233 2.1512 1.3268 0.7883 4.5876 7.8535 0.2612 4.4686 10.0087 4.4959 1.9851 4.4154 32.0072 5.0962 15.0353 3.1911 18.4961 1.0964 6.9338 4.5473 0.7368 3.4560 13.8834 0.1225 37.2637 8.9787 10.5836 21.2645 50.4674 9.5123 9.5897 11.2774 3.4118 9.5300 6.1469 7.2673 11.9654 0.3796 44.1941 3.3168 3.1425 89.3358 222.9260 16.6217 30.6192 53.3380 2.7983 4.5698 78.7412 50.1968 14.4138 51.1649 5.9571 9.6213 7.7841 107.3524 16.9707 7.4763 19.0801 7.3900 15.1368 12.9836 9.0703 0.1825 9.7763 8.1906 11.4110 5.6434 60.6560 10.1045 9.5451 137.1380 46.0203 18.9387 14.4544 143.1616 42.8372 102.2539 27.0603 18.3402 27.6447 12.6841 28.2706 20.0305 1.0613 8.7378 0.4227 1.6164 26.2166 15.2117 15.6471 33.8401
temp: 298.150 k
press: 1.00000 atm
elementType: 8 8 8 8 6 6 6 6 6 6 6 6 6 6 6 6 6 6 6 6 1 1 1 1 1 1 1 1 1 1 1 1 1 1 1 1
symmnumber: 1
zpe: 740896.5 jmol-1
zpe.correction: 0.282193 hartree
zpe.thermalcorrener: 0.301090 hartree
zpe.thermalcorrenthalpy: 0.302035 hartree
zpe.thermalcorrgfe: 0.233227 hartree
zpe.sumelectzpe: -918.730931 hartree
zpe.sumelectthermal: -918.712033 hartree
zpe.sumelectthermalent: -918.711089 hartree
zpe.sumelectthermalfe: -918.779897 hartree
dipole: -0.7618 3.2065 -2.5366
dipole: 4.1589
quadrupole: -93.2801 -107.0837 -124.0775
quadrupole: -0.9211 -9.6385 -6.4180
quadrupole: 14.8670 1.0634 -15.9304 -0.9211 -9.6385 -6.4180
hfenergy: -919.0131238 hartree
pointgroup: C01[X(C16H16O4)]
dipole: 0.3802616 0.3053073 1.5618579 debye
polarizability: 259.4551715|54.7865098|146.7138272|-21.9932651|28.5508833|174.1142654 unknown
InChI: InChI=1S/C16H16O4/c1-19-15(16(18)20-2)10-14(17)13-8-7-11-5-3-4-6-12(11)9-13/h3-9,15H,10H2,1-2H3
charge 0 multiplicity 1
36 atoms
O  -3.523291 -0.468433 -1.075752
O  -1.088045 -2.572358 -1.087338
O  -2.485989 1.192778 1.955761
O  -2.171744 1.798131 -0.27631
C  -2.219425 -1.578176 0.795439
C  -3.167681 -0.415085 0.326347
C  0.258939 -0.99075 0.134087
C  -1.000993 -1.76697 -0.110569
C  2.458098 -0.267338 -0.729078
C  2.713083 0.441549 0.510798
C  1.229702 -0.976418 -0.881838
C  0.515853 -0.279545 1.358207
C  1.713859 0.409296 1.539446
C  3.451487 -0.238877 -1.765804
C  3.950819 1.146781 0.666565
C  -2.551265 0.969866 0.568014
C  4.647548 0.457615 -1.585992
C  4.898758 1.155302 -0.35989
C  -4.303685 -1.658071 -1.443795
C  -1.903538 2.497056 2.355491
H  -2.797791 -2.517587 0.759136
H  -1.949959 -1.380605 1.846188
H  -4.074942 -0.481264 0.969908
H  1.018389 -1.524408 -1.807232
H  -0.224264 -0.290578 2.164275
H  1.909925 0.934773 2.481893
H  3.253611 -0.773329 -2.702233
H  4.144214 1.682151 1.603772
H  5.400362 0.476148 -2.381263
H  5.84168 1.698538 -0.232892
H  -4.649059 -1.467217 -2.47123
H  -5.182994 -1.786139 -0.776103
H  -3.675032 -2.567869 -1.42886
H  -0.853624 2.560461 2.021529
H  -1.977169 2.515249 3.451961
H  -2.476838 3.323625 1.903659
