program: Gaussian 09
title: 000251720
version: EM64L-G09RevD.01
frameworkgroup: C1[X(C12H13Br2NO3)]
method: RPBEPBE
basis: SDD
operation: Freq
keyword: #p
keyword: freq=noraman
keyword: PBEPBE/SDD
title: #p freq=noraman PBEPBE/SDD
converged: YES YES NO NO
title: Mulliken charges:
elementType: Br Br O O O N C C C C C C C C C C C C H H H H H H H H H H H H H
charge: -0.018380 -0.005654 -0.260818 -0.257191 -0.258121 -0.158384 -0.315439 -0.379067 0.343650 0.132021 0.212540 -0.498114 0.179629 -0.370306 -0.678611 -0.657015 -0.337193 -0.203013 0.284644 0.234343 0.284321 0.252163 0.288668 0.257660 0.324311 0.276937 0.293253 0.287863 0.259034 0.241074 0.245194
chargesum: 0.00000
title: Mulliken charges with hydrogens summed into heavy atoms:
elementType: Br Br O O O N C C C C C C C C C C C C
charge: -0.018380 -0.005654 -0.260818 -0.257191 -0.258121 -0.158384 0.203548 0.157417 0.343650 0.132021 0.212540 -0.209446 0.179629 -0.112646 -0.077363 -0.075900 -0.078159 0.283255
polarizability: 2.63491501e+02 1.87186352e+00 1.57455290e+02 -5.58902075e+00 1.64213160e+01 1.33273797e+02
1716.lowfreq: -3.3537 -0.0001 0.0005 0.0006 2.0596 5.5694 17.1260 24.9517 29.6606
frequency: 16.9737 24.9191 29.6390 47.6760 60.1360 66.7705 80.0214 92.3106 97.4293 141.6323 156.4778 183.7409 218.0947 221.3543 241.0279 300.1015 329.4627 377.7744 404.8901 416.0280 431.9369 497.0416 555.5945 587.0843 620.4149 628.7259 662.9484 680.3606 700.7056 713.3319 741.2320 764.9406 770.3323 778.8406 822.1719 830.8772 851.8596 891.7682 930.7544 940.8029 969.7690 973.5645 999.3596 1033.1901 1050.8088 1059.3799 1067.9006 1095.5707 1108.1899 1123.0582 1143.4151 1191.8878 1217.4751 1231.7123 1232.4818 1246.3399 1263.8095 1280.0338 1305.9404 1347.0867 1353.7113 1363.2123 1379.1322 1384.5995 1443.7594 1444.9545 1450.4018 1455.5816 1471.6884 1481.5240 1487.0298 1552.6571 1607.9018 1621.6694 3015.0987 3027.4228 3033.4368 3057.0949 3064.0865 3095.0118 3107.2685 3117.3439 3145.5483 3147.2270 3157.5663 3183.0951 3185.7685
redmass: 9.7771 13.7742 8.9683 5.2812 2.5239 2.8925 4.1910 5.0108 3.1056 13.3529 6.6530 4.8352 4.9529 5.6387 5.4637 7.9390 4.0937 4.2415 4.7780 3.9247 3.9503 4.7556 6.8471 6.4793 6.4187 5.6535 5.2541 8.1977 5.0328 5.6441 3.7692 1.2121 1.2021 6.1617 1.4431 6.5983 5.7972 1.5346 3.0181 1.3167 1.7585 2.8651 1.5642 4.6837 4.0851 3.0576 1.4719 1.9047 1.5808 1.0480 1.4050 1.8788 2.0274 1.1673 1.3555 2.8792 1.4190 1.5912 1.2538 1.2829 1.2680 1.3624 2.4626 2.4333 1.8779 1.6059 1.1120 1.1232 1.7375 1.2732 1.4218 7.8065 7.9958 8.2054 1.0567 1.0602 1.0649 1.0566 1.0565 1.1053 1.1155 1.0993 1.0920 1.1085 1.1120 1.0947 1.0947
irintensity: 0.2555 0.2100 0.1718 0.4793 13.5941 2.7701 1.3817 4.8689 2.7199 1.1846 1.0181 5.0279 1.6016 2.8463 0.1715 0.3318 16.9204 7.9374 1.2036 10.6517 8.0187 23.5183 8.9059 37.1277 16.0632 10.3633 46.9755 10.7902 1.8160 10.3289 23.8070 15.4165 3.6658 28.0977 42.7782 46.6021 7.0204 25.0669 0.9103 2.0727 72.8960 104.2283 6.4166 2.3777 0.5283 13.9885 5.8512 81.9734 39.1387 1.1477 12.3534 24.4882 4.3675 23.9839 7.2698 248.2114 49.6565 206.1311 37.0978 40.8484 6.4574 1.8239 24.8193 168.3914 46.9205 77.7937 6.8984 46.5647 87.2900 10.3078 21.3722 207.0179 5.3231 13.2189 122.5478 9.9607 15.4744 12.5128 13.2246 4.9764 26.5569 1.9861 12.1521 5.4324 2.9225 0.9822 3.0447
temp: 298.150 k
press: 1.00000 atm
elementType: 35 35 8 8 8 7 6 6 6 6 6 6 6 6 6 6 6 6 1 1 1 1 1 1 1 1 1 1 1 1 1
symmnumber: 1
zpe: 608199.1 jmol-1
zpe.correction: 0.231651 hartree
zpe.thermalcorrener: 0.249920 hartree
zpe.thermalcorrenthalpy: 0.250864 hartree
zpe.thermalcorrgfe: 0.179456 hartree
zpe.sumelectzpe: -771.059010 hartree
zpe.sumelectthermal: -771.040741 hartree
zpe.sumelectthermalent: -771.039797 hartree
zpe.sumelectthermalfe: -771.111205 hartree
dipole: -3.3763 0.9676 1.7617
dipole: 3.9292
quadrupole: -117.7995 -140.3878 -123.3229
quadrupole: 11.9773 2.3564 -4.9164
quadrupole: 9.3705 -13.2177 3.8472 11.9773 2.3564 -4.9164
hfenergy: -771.290661 hartree
pointgroup: C01 [X(C12H13Br2N1O3)]
dipole: 1.3050021 -0.311016 0.7681112 debye
polarizability: 263.2769451|-5.3653592|149.0753366|4.0980971|-20.4286643|141.8683066 unknown
InChI: InChI=1S/C12H13Br2NO3/c13-3-5-15(6-4-14)12(16)9-1-2-10-11(7-9)18-8-17-10/h1-2,7H,3-6,8H2
charge 0 multiplicity 1
31 atoms
Br -5.952378 1.499894 -0.195204
Br -1.508107 -4.436814 0.99811
O  3.842441 0.322284 -1.513825
O  4.414448 0.491115 0.812665
O  -1.42009 1.232777 -1.580162
N  -2.071055 -0.296165 0.045671
C  -3.48301 -0.060791 -0.366467
C  -1.790247 -1.523694 0.830271
C  0.335996 0.393861 -0.1485
C  -1.091961 0.466827 -0.618234
C  2.672238 0.386352 -0.719897
C  1.349528 0.354336 -1.153195
C  3.012312 0.483496 0.649128
C  0.682402 0.503045 1.223939
C  -4.00775 1.218034 0.304805
C  -1.771522 -2.752414 -0.099859
C  2.037279 0.555248 1.646903
C  4.975111 0.511491 -0.569328
H  -3.540274 0.052109 -1.462617
H  -4.092053 -0.928483 -0.062136
H  -0.819479 -1.442145 1.338041
H  -2.567515 -1.645237 1.605291
H  1.08205 0.32362 -2.211948
H  -0.107732 0.59944 1.976095
H  -3.47925 2.111054 -0.056634
H  -3.994282 1.157942 1.403409
H  -0.926152 -2.723837 -0.803955
H  -2.720395 -2.90149 -0.637071
H  2.305928 0.654546 2.701109
H  5.437643 1.498014 -0.751897
H  5.681176 -0.326415 -0.680309
