program: Gaussian 09
title: 000019529
version: EM64L-G09RevD.01
frameworkgroup: C1[X(C14H11Cl2NO4)]
method: RPBEPBE
basis: SDD
operation: Freq
keyword: #p
keyword: freq=noraman
keyword: PBEPBE/SDD
title: #p freq=noraman PBEPBE/SDD
converged: YES YES NO NO
title: Mulliken charges:
elementType: Cl Cl O O O O N C C C C C C C C C C C C C C H H H H H H H H H H H
charge: 0.022236 0.079029 -0.301138 -0.195764 -0.208965 -0.215984 -0.221330 0.450727 -0.289340 -0.354653 0.399290 -0.422549 -0.318637 -0.680353 0.340966 -0.741110 0.190524 0.173793 -0.325948 -0.250799 -0.145171 0.284120 0.244654 0.256515 0.305048 0.266180 0.239165 0.264179 0.343088 0.279863 0.262397 0.269968
chargesum: 0.00000
title: Mulliken charges with hydrogens summed into heavy atoms:
elementType: Cl Cl O O O O N C C C C C C C C C C C C C C
charge: 0.022236 0.079029 -0.301138 -0.195764 -0.208965 -0.215984 -0.221330 0.450727 -0.005221 -0.110000 0.399290 -0.166035 -0.013589 0.089171 0.340966 -0.398022 0.190524 0.173793 -0.046084 0.011598 0.124797
polarizability: 3.56704332e+02 -5.64383740e+00 1.72474135e+02 1.19041087e+00 -1.13540949e+01 1.13384880e+02
1716.lowfreq: -8.1156 -2.5204 -0.0020 -0.0018 0.0014 0.7442 18.2778 19.9522 32.2894
frequency: 18.1566 19.9410 32.2712 43.3882 56.6410 67.9757 80.9546 97.6094 130.1583 145.6696 178.6698 186.2648 192.7080 226.5096 239.1437 255.6145 285.1811 317.1653 329.9962 350.6388 405.8234 415.6469 418.7736 484.7532 523.6108 529.8048 575.2631 584.0215 590.8158 611.3907 628.6199 690.3452 705.4670 718.8549 739.0247 756.9721 758.6211 763.9621 798.1285 821.5611 842.0324 844.3891 869.8702 875.2241 888.8420 903.6139 954.5080 969.0745 994.9483 1005.8364 1041.4047 1056.6688 1071.7240 1101.5487 1117.4367 1127.9746 1144.3076 1158.8682 1176.9401 1206.3447 1212.2156 1214.7086 1252.6515 1257.5793 1306.7067 1334.3874 1368.6638 1376.8290 1420.8252 1442.6285 1452.5703 1484.7189 1491.6608 1502.4100 1537.4247 1580.1169 1605.3346 1617.1271 1658.8535 2981.9612 3081.8280 3115.2287 3130.6900 3152.0983 3166.6505 3207.2796 3212.4488 3229.2601 3250.2246 3270.0924
redmass: 7.4699 9.5921 8.4217 5.1673 7.0139 7.2622 6.6807 6.2795 8.5024 8.6273 4.5081 4.8012 1.7500 4.9902 5.6986 8.0966 5.8637 10.0384 6.2470 5.0763 3.3819 5.7391 3.6572 7.4841 2.8962 6.7448 8.6579 6.1470 3.0470 5.3669 7.1467 7.2569 7.0888 4.2984 7.0849 1.2480 9.6134 8.3085 7.2022 1.2901 1.3790 1.5341 6.7256 4.1665 4.7619 1.3883 1.3427 1.3254 2.4990 2.6221 2.4692 2.6788 2.5566 1.5832 1.5587 1.3536 1.8326 2.1889 1.2649 1.4770 1.6187 1.6232 2.1719 7.4201 1.3181 3.5842 2.6546 7.2312 3.5978 1.1602 5.3657 1.0698 2.4740 1.0439 6.2761 7.5401 9.9458 6.7146 11.4066 1.0403 1.0962 1.0999 1.0888 1.0906 1.0910 1.0950 1.0947 1.0918 1.0994 1.1089
irintensity: 6.6743 0.2728 0.7306 0.7159 1.8259 1.0716 1.0076 1.6508 0.4223 0.1720 1.3882 1.8092 0.7199 2.7204 1.0295 3.8550 0.6835 2.6153 7.4888 3.4982 3.0924 0.9151 0.7070 1.0314 21.5987 8.8780 55.2731 10.4656 3.3114 15.8802 0.2304 36.1687 12.3798 2.8877 21.8035 84.8052 41.3474 48.8228 1.2841 4.4360 0.8048 83.1633 6.9972 44.9695 53.5003 1.2513 2.8915 1.0203 145.7561 86.2256 189.9893 262.0851 86.3716 26.8428 12.4885 12.8220 4.6749 330.1201 13.9040 124.9685 25.5657 95.7605 2.9036 149.3960 20.6717 101.6754 4.8922 5.0035 13.3448 9.3603 181.2286 16.8181 274.0375 28.5984 42.4791 13.8397 170.9645 19.8732 213.7942 41.4904 12.2987 8.2391 5.1813 12.7315 3.4635 0.2664 4.9057 3.2874 0.4524 0.0275
temp: 298.150 k
press: 1.00000 atm
elementType: 17 17 8 8 8 8 7 6 6 6 6 6 6 6 6 6 6 6 6 6 6 1 1 1 1 1 1 1 1 1 1 1
symmnumber: 1
zpe: 586426.5 jmol-1
zpe.correction: 0.223358 hartree
zpe.thermalcorrener: 0.243107 hartree
zpe.thermalcorrenthalpy: 0.244051 hartree
zpe.thermalcorrgfe: 0.171011 hartree
zpe.sumelectzpe: -1814.312740 hartree
zpe.sumelectthermal: -1814.292992 hartree
zpe.sumelectthermalent: -1814.292047 hartree
zpe.sumelectthermalfe: -1814.365087 hartree
dipole: 2.7855 1.6357 1.5075
dipole: 3.5647
quadrupole: -117.0264 -130.5628 -138.1088
quadrupole: -35.0884 4.6847 -4.0472
quadrupole: 11.5396 -1.9968 -9.5428 -35.0884 4.6847 -4.0472
hfenergy: -1814.5360985 hartree
pointgroup: C01 [X(C14H11Cl2N1O4)]
dipole: 1.0727959 -0.4883381 -0.759953 debye
polarizability: 356.871242|-1.5762395|173.6550441|-0.6399142|6.8760822|112.0370609 unknown
InChI: InChI=1S/C14H11Cl2NO4/c1-17(13(18)12(15)16)9-4-6-10(7-5-9)21-14(19)11-3-2-8-20-11/h2-8,12H,1H3
charge 0 multiplicity 1
32 atoms
Cl -6.341228 0.623639 -1.257934
Cl -6.662201 0.742379 1.786088
O  2.309348 0.133437 0.119849
O  5.782031 -0.941118 0.254467
O  -3.820158 1.363077 1.151795
O  3.160995 -2.081277 0.208118
N  -3.334448 -0.575439 -0.091181
C  -1.899031 -0.407373 -0.004761
C  -1.294889 0.876681 -0.063831
C  -1.07177 -1.552802 0.104927
C  0.915858 -0.158317 0.083955
C  0.104469 0.994099 -0.018418
C  0.334291 -1.44595 0.146456
C  -3.835344 -1.77811 -0.806996
C  -4.199316 0.335794 0.529017
C  -5.704721 -0.009113 0.409656
C  4.61982 -0.140654 0.201784
C  3.335892 -0.844172 0.18037
C  4.982189 1.205343 0.183069
C  6.420228 1.256522 0.225362
C  6.864972 -0.059651 0.267705
H  -1.912789 1.772202 -0.133432
H  -1.516204 -2.550522 0.17803
H  0.582793 1.976549 -0.06557
H  0.956386 -2.336609 0.232073
H  -4.739636 -1.535708 -1.387521
H  -4.049824 -2.61736 -0.118225
H  -3.068214 -2.102942 -1.525907
H  -5.941181 -1.07924 0.416999
H  4.288246 2.041167 0.145092
H  7.044915 2.147021 0.225137
H  7.846419 -0.524155 0.307528
