program: Gaussian 09
title: 000251703
version: EM64L-G09RevD.01
frameworkgroup: C1[X(C10H10O4)]
method: RPBEPBE
basis: SDD
operation: Freq
keyword: #pfreq=noraman
keyword: PBEPBE/SDD
title: #p freq=noraman PBEPBE/SDD
converged: YES YES NO NO
title: Mulliken charges:
elementType: O O O O C C C C C C C C C C H H H H H H H H H H
charge: -0.317645 -0.284714 -0.205176 -0.180909 0.146301 0.243692 0.280355 -0.332225 -0.367342 -0.201102 -0.201870 0.261012 -0.526763 -0.746368 0.258813 0.277968 0.238415 0.188742 0.242608 0.237710 0.225928 0.253872 0.255621 0.253079
chargesum: 0.00000
title: Mulliken charges with hydrogens summed into heavy atoms:
elementType: O O O O C C C C C C C C C C
charge: -0.317645 -0.284714 -0.205176 -0.180909 0.146301 0.243692 0.280355 -0.073412 -0.089374 0.037313 -0.013129 0.261012 0.179483 0.016204
polarizability: 1.50047492e+02 3.14161079e+00 1.38040529e+02 -6.73734250e+00 9.84603428e+00 7.59580691e+01
1716.lowfreq: -9.6929 -6.6724 -1.6557 0.0009 0.0010 0.0010 22.9161 51.8097 65.2468
frequency: 22.8591 51.7794 65.2464 79.5045 85.5597 98.0562 152.5534 158.2386 179.5398 203.4615 251.3544 296.1482 326.0999 349.4570 385.5366 462.9053 500.4615 522.2428 545.8900 564.8644 586.3692 648.6721 715.0959 751.1538 775.5589 814.8025 851.3816 884.1140 929.7248 981.8050 985.0015 992.4163 1000.9181 1038.4433 1058.8805 1109.9391 1129.3227 1152.7840 1168.3783 1174.2946 1236.6668 1252.6938 1362.2079 1383.7050 1386.9263 1424.3537 1439.7781 1451.8596 1452.7284 1456.9957 1460.6115 1478.5342 1574.4974 1594.6036 1614.2723 1700.6461 2936.7682 2973.1128 3008.1117 3069.4353 3098.3236 3125.9005 3144.2545 3145.1870 3159.7935 3174.3418
redmass: 9.3007 1.7246 4.7088 1.6141 2.9009 5.0694 1.2753 3.3591 3.1214 3.4492 4.1433 5.1111 5.0993 5.5712 5.3996 5.2139 4.3798 5.0515 3.8965 4.7690 4.2570 5.1524 4.6002 4.6771 4.0112 1.6783 7.1485 5.9817 1.3826 1.9617 1.7641 5.3566 1.5186 1.6438 2.1721 1.2351 2.9508 1.3736 1.7881 1.6274 2.1639 3.3227 2.3415 1.4688 1.8129 1.3704 2.7161 1.0548 1.0793 2.0008 1.0834 1.0551 7.0429 7.2242 6.8068 10.6913 1.0860 1.0314 1.0378 1.1036 1.0956 1.1024 1.0866 1.1017 1.0925 1.0992
irintensity: 0.2369 3.1397 2.6357 1.5042 4.6450 0.9473 1.7882 8.0938 5.8295 12.7015 6.7564 3.3538 6.7493 3.7580 2.7339 7.8147 2.6315 2.4492 1.0047 3.1987 1.9396 9.6475 23.2758 36.9389 49.9123 43.6993 84.9467 15.3150 0.3314 66.0197 26.4044 60.6451 7.5850 7.8265 46.7296 5.0893 298.9240 16.0174 72.2804 26.1496 74.3485 173.7148 1.1144 98.6801 3.9233 14.2000 20.5110 21.3059 21.1756 35.5723 10.9204 11.5854 149.9756 16.7529 104.2480 165.4102 77.6299 64.3407 1.0375 32.3880 5.6796 20.8793 4.3107 7.2844 1.9156 12.3329
temp: 298.150 k
press: 1.00000 atm
elementType: 8 8 8 8 6 6 6 6 6 6 6 6 6 6 1 1 1 1 1 1 1 1 1 1
symmnumber: 1
zpe: 467483.4 jmol-1
zpe.correction: 0.178055 hartree
zpe.thermalcorrener: 0.192407 hartree
zpe.thermalcorrenthalpy: 0.193352 hartree
zpe.thermalcorrgfe: 0.135095 hartree
zpe.sumelectzpe: -686.901956 hartree
zpe.sumelectthermal: -686.887604 hartree
zpe.sumelectthermalent: -686.886660 hartree
zpe.sumelectthermalfe: -686.944917 hartree
dipole: 3.2505 2.4819 -2.6930
dipole: 4.8967
quadrupole: -76.3192 -77.6587 -86.6815
quadrupole: -14.0410 -9.0012 -0.7677
quadrupole: 3.9006 2.5611 -6.4617 -14.0410 -9.0012 -0.7677
hfenergy: -687.0800114 hartree
pointgroup: C01 [X(C10H10O4)]
dipole: -1.3212768 0.9211509 1.056977 debye
dipolederiv: -1.273753 -0.7108166 -0.2489432 -0.7813999 -0.8623698 -0.2156182 -0.2593876 -0.2783801 -0.6017356 -1.2489093 0.3749631 0.3494589 0.1469747 -0.4265827 -0.087004 0.2134033 -0.0959107 -0.4290319 -0.8359867 0.5008923 -0.1281584 0.2716738 -0.7286589 0.1014434 -0.0276789 0.0684807 -0.3407284 -0.4522329 -0.1366196 0.1490785 -0.1754766 -0.3744316 0.0145831 -0.2704943 -0.3107482 -0.8982993 0.6117987 0.14475 0.1279989 0.6114261 0.5489789 -0.0613767 -0.3115001 -0.1609033 -0.0175863 1.0034352 -0.4777602 -0.2342432 -0.424308 0.0465209 0.1245681 0.0555825 0.068573 -0.0179446 -0.1372023 0.0479721 -0.027803 0.2629469 -0.7644067 0.1808386 -0.0702312 0.231596 -0.0189697 -0.0679643 0.1050546 0.0431462 -0.0820214 0.0505817 -0.0715261 0.0778968 -0.1094379 -0.1075861 -0.0654352 0.0752163 -0.0372722 -0.1648808 0.0124009 -0.0316614 0.0421939 -0.0603105 -0.0999755 -0.0438014 0.1029777 -0.0661628 0.208462 0.0109152 -0.0672332 -0.0777689 -0.0717067 -0.1131731 0.8887275 -0.3432801 0.0538185 -0.484521 1.3171673 -0.3261775 0.0700762 -0.3333451 0.210869 1.256799 0.7940521 0.0519698 0.802644 0.818438 0.191941 0.6527097 0.6669689 1.3732319 0.4892093 -0.1078181 -0.179498 0.0459065 0.2811136 0.0809395 -0.3767575 0.2110783 0.4959569 -0.2874375 -0.1993669 0.1264239 -0.140273 -0.0625096 0.042393 0.1441979 0.0831718 -0.0997796 0.0866698 0.0432947 -0.0133351 0.0349082 -0.0261377 0.0447239 -0.0019983 0.0491187 0.1471151 -0.0003437 0.0005613 0.0122864 0.0476946 0.1089734 0.0070078 0.0015628 0.0227281 0.1531798 -0.0103089 -0.0841116 0.0507834 -0.0831242 0.0076916 0.0584026 0.0443598 0.0657972 0.1329422 -0.0845918 -0.1685189 0.079167 -0.0789914 -0.0599049 0.0466923 0.0431829 0.0675876 0.0817711 0.0762122 0.0133969 0.0020442 -0.0408804 -0.0524893 0.1168505 0.0651205 0.0568228 -0.0076591 -0.1373953 0.0852528 0.0050866 0.0611338 0.0953838 -0.0070451 -0.0230925 0.0006311 0.0666593 0.0279538 -0.1088705 -0.061427 -0.0389386 -0.0572117 -0.1280085 0.0774972 -0.1232107 -0.0579266 0.0883688 0.0525057 -0.0761693 -0.0035427 0.0774978 0.0724234 -0.0556295 0.0700631 0.0142152 0.0688885 -0.0601045 -0.0234515 -0.0850784 0.0315282 -0.05124 -0.0482826 -0.0859776 0.0219815 0.0472994 0.0563774 0.0452015 0.0896658 0.0075115 -0.0359165 0.035038 -0.0326864 0.1124737 unknown
polarizability: 150.095827|-2.787147|136.6915613|-7.7738267|-12.7441997|77.2587022 unknown
InChI: InChI=1S/C10H10O4/c1-7(12)14-10-8(6-11)4-3-5-9(10)13-2/h3-6H,1-2H3
charge 0 multiplicity 1
24 atoms
O  -0.932543 -0.767796 0.621575
O  -1.589539 1.884031 -0.183307
O  3.004527 -2.128251 0.552053
O  -1.43053 -1.349014 -1.602838
C  0.100401 0.124493 0.197875
C  -0.250606 1.451344 -0.159413
C  1.450959 -0.306021 0.172542
C  0.763226 2.341296 -0.577511
C  2.457751 0.610016 -0.237373
C  2.11344 1.919033 -0.621736
C  1.820813 -1.693855 0.560664
C  -1.707864 -1.425561 -0.398548
C  -2.248199 1.985794 1.140111
C  -2.838958 -2.18046 0.254841
H  0.47042 3.354578 -0.870345
H  3.49385 0.255842 -0.250619
H  2.888428 2.618627 -0.950962
H  0.975391 -2.346873 0.877402
H  -2.2165 1.02103 1.677509
H  -3.28861 2.2706 0.923674
H  -1.761288 2.771392 1.748652
H  -2.479044 -2.734026 1.137467
H  -3.293174 -2.869888 -0.471114
H  -3.607151 -1.465533 0.601301
