program: Gaussian 09
title: 000251702
version: EM64L-G09RevD.01
frameworkgroup: C1[X(C17H13NO4)]
method: RPBEPBE
basis: SDD
operation: Freq
keyword: #p
keyword: freq=noraman
keyword: PBEPBE/SDD
title: #p freq=noraman PBEPBE/SDD
converged: YES YES NO NO
title: Mulliken charges:
elementType: O O O O N C C C C C C C C C C C C C C C C C H H H H H H H H H H H H H
charge: -0.259478 -0.274748 -0.246636 -0.274334 -0.466110 0.454679 0.042966 0.250291 -0.368351 0.227290 -0.439350 0.065155 -0.350273 -0.222368 0.139875 0.254786 -0.333695 -0.338160 -0.225610 -0.243243 -0.224494 -0.492865 0.325127 0.247448 0.259919 0.353393 0.234989 0.275764 0.216987 0.234710 0.233936 0.235287 0.229713 0.239341 0.238057
chargesum: 0.00000
title: Mulliken charges with hydrogens summed into heavy atoms:
elementType: O O O O N C C C C C C C C C C C C C C C C C
charge: -0.259478 -0.274748 -0.246636 -0.274334 -0.112717 0.454679 0.042966 0.250291 -0.043224 0.227290 -0.191902 0.065155 -0.090354 0.012621 0.139875 0.254786 -0.057931 -0.121173 0.009099 -0.009307 0.010793 0.214245
polarizability: 3.89182175e+02 2.80350280e+01 2.28864656e+02 -3.76832356e+00 3.84489443e+00 8.35050428e+01
1716.lowfreq: -31.5375 -9.9465 -6.4158 -3.6841 -0.0006 -0.0004 -0.0001 15.9515 27.4309
frequency: -31.5317 15.4044 27.4177 56.0120 63.4152 110.0088 121.5638 151.5538 164.7659 168.2055 191.5566 217.0281 243.5167 282.2671 301.8662 319.7872 339.0327 398.0057 402.6596 413.2034 427.5958 451.0198 475.6881 487.5917 534.5184 545.0820 577.0962 577.7611 614.2419 640.8440 665.0897 685.4780 694.0135 698.9462 714.2845 733.4693 747.7998 777.7327 791.7089 795.5770 853.2530 861.9868 883.3900 893.7465 936.8286 941.3615 948.7144 972.1909 987.0007 988.9984 1008.9835 1010.2333 1034.9165 1054.0224 1081.0280 1088.5927 1105.0453 1122.9422 1157.3355 1158.9074 1174.6579 1176.8022 1192.4953 1199.0330 1250.1313 1262.9772 1289.2794 1323.6553 1358.8192 1386.7823 1397.6041 1431.0164 1435.1347 1444.4351 1460.1724 1461.3256 1469.8419 1479.4900 1514.1225 1565.1582 1578.2443 1590.6150 1602.6533 1610.5602 1623.0687 1634.2741 3003.9890 3112.4392 3120.0734 3132.2166 3134.6126 3144.0470 3148.0290 3160.7766 3160.8453 3171.8051 3177.9982 3182.1811 3473.1567
redmass: 3.0516 4.0615 6.4742 6.4240 6.9758 7.2886 6.5270 5.5734 5.2810 2.9872 3.0714 1.6567 6.4339 4.7172 4.0908 9.2367 5.0916 2.9715 5.4170 5.0973 7.1531 5.2608 5.5648 7.4241 3.9189 6.4417 4.7709 6.5316 6.4375 8.4578 6.5358 4.9107 1.7037 4.1705 3.1332 3.4623 1.4092 6.6281 1.6441 2.4530 1.2582 7.6060 1.3728 6.2227 1.5486 5.1729 1.3944 1.3375 1.4254 5.4011 1.3484 5.6623 2.3968 2.7769 2.4159 1.5908 1.2473 3.4457 1.5744 2.7454 1.0610 1.4719 1.3694 1.2379 2.0872 2.2227 3.9953 1.3499 2.7824 8.7806 7.7271 1.9511 2.1701 2.0263 1.0515 1.0580 2.5462 2.2391 2.3281 5.9451 6.4852 7.5110 6.6830 6.0337 5.8516 10.6871 1.0289 1.1052 1.0880 1.1052 1.0869 1.0869 1.0918 1.0957 1.0930 1.1009 1.0984 1.0935 1.0758
irintensity: 8.1304 0.5651 0.2751 3.2845 3.1775 0.7542 6.0964 0.5718 3.4226 0.4857 0.4346 1.6344 16.9256 0.1309 1.9195 3.6305 1.2557 0.1466 0.4251 0.7575 11.0415 11.3641 5.8163 0.1772 0.0395 16.2570 0.0577 1.3029 0.6291 40.2118 1.0567 3.8335 32.4829 8.6512 10.1600 87.3506 86.1563 0.1947 38.6481 25.9858 0.2137 31.8077 5.7594 8.0735 2.3775 9.2690 31.3832 6.3016 1.4932 1.4834 1.5447 3.1750 23.8301 62.3524 61.5099 26.2804 0.0156 52.3068 9.4291 10.1816 4.6818 16.4916 8.5074 10.1912 158.7039 100.5412 7.7593 2.8425 375.7639 1.7200 65.8826 62.1499 11.9283 76.5313 21.3963 51.9231 55.0514 52.3410 720.3259 183.9942 87.9025 94.0677 72.3211 13.0778 62.8195 156.7711 46.4776 31.0451 12.6793 30.2567 1.2677 4.4596 18.3323 13.5597 10.1159 27.2791 12.0452 2.8593 42.5789
temp: 298.150 k
press: 1.00000 atm
elementType: 8 8 8 8 7 6 6 6 6 6 6 6 6 6 6 6 6 6 6 6 6 6 1 1 1 1 1 1 1 1 1 1 1 1 1
symmnumber: 1
zpe: 686338.3 jmol-1
zpe.correction: 0.261412 hartree
zpe.thermalcorrener: 0.279152 hartree
zpe.thermalcorrenthalpy: 0.280096 hartree
zpe.thermalcorrgfe: 0.213932 hartree
zpe.sumelectzpe: -1009.733908 hartree
zpe.sumelectthermal: -1009.716169 hartree
zpe.sumelectthermalent: -1009.715224 hartree
zpe.sumelectthermalfe: -1009.781389 hartree
dipole: -0.9826 -0.2083 -0.0735
dipole: 1.0071
quadrupole: -100.1700 -122.9080 -131.2402
quadrupole: 6.8157 -0.6494 1.8918
quadrupole: 17.9361 -4.8019 -13.1342 6.8157 -0.6494 1.8918
hfenergy: -1009.9953205 hartree
pointgroup: C01 [X(C17H13N1O4)]
dipole: -0.3845423 0.0907821 0.0298548 debye
polarizability: 388.1714138|-30.832772|229.9127001|0.7245152|-4.3959144|83.4677599 unknown
InChI: InChI=1S/C17H13NO4/c1-21-14-9-5-8-12-10-13(17(20)22-15(12)14)18-16(19)11-6-3-2-4-7-11/h2-10,18H,1H3
charge 0 multiplicity 1
35 atoms
O  2.32641 1.13442 -0.255535
O  5.288511 0.976353 -0.262347
O  0.396655 2.376219 -0.364764
O  -1.988644 -1.987347 0.06958
N  -1.231093 0.21079 -0.128113
C  2.24808 -1.310339 -0.012559
C  3.000424 -0.10299 -0.137999
C  0.156254 -0.018129 -0.121244
C  0.803317 -1.237562 -0.007509
C  4.423546 -0.108957 -0.149812
C  2.938312 -2.549052 0.101383
C  0.918471 1.238453 -0.254457
C  5.07495 -1.362951 -0.034593
C  4.343591 -2.56517 0.088856
C  -2.243561 -0.744019 -0.012929
C  -3.652365 -0.215884 -0.004315
C  -4.692417 -1.16695 -0.17233
C  -3.988289 1.152901 0.179085
C  -6.041263 -0.759629 -0.174445
C  -5.340174 1.558795 0.179371
C  -6.369552 0.606026 -0.001868
C  4.813577 2.370032 -0.385809
H  0.209088 -2.149305 0.085213
H  2.361241 -3.474293 0.197022
H  6.168859 -1.360237 -0.045139
H  -1.474525 1.200448 -0.25219
H  4.884167 -3.512852 0.175392
H  -4.412451 -2.21816 -0.295037
H  -3.218446 1.9148 0.352236
H  -6.835206 -1.501968 -0.30934
H  -5.589708 2.614837 0.327518
H  -7.417645 0.924971 -0.002074
H  5.741202 2.958077 -0.454025
H  4.202416 2.506514 -1.292634
H  4.228865 2.673656 0.497814
