program: Gaussian 09
title: 000251691
version: EM64L-G09RevD.01
frameworkgroup: C1[X(C10H12O3)]
method: RPBEPBE
basis: SDD
operation: Freq
keyword: #pfreq=noraman
keyword: PBEPBE/SDD
title: #p freq=noraman PBEPBE/SDD
converged: YES YES NO NO
title: Mulliken charges:
elementType: O O O C C C C C C C C C C H H H H H H H H H H H H
charge: -0.280110 -0.262073 -0.236833 0.449130 0.095013 0.252777 -0.610597 0.361703 -0.531821 -0.793910 -0.230618 -0.532834 -0.534671 0.250513 0.268977 0.253149 0.253094 0.207674 0.216195 0.226959 0.226950 0.248693 0.247893 0.227396 0.227352
chargesum: 0.00000
title: Mulliken charges with hydrogens summed into heavy atoms:
elementType: O O O C C C C C C C C C C
charge: -0.280110 -0.262073 -0.236833 0.449130 0.095013 0.252777 -0.360085 0.361703 -0.262845 -0.079992 -0.014422 0.169767 0.167970
polarizability: 1.73122815e+02 -4.32820224e+00 1.44142143e+02 -5.23845268e-03 4.85280892e-03 6.24704713e+01
1716.lowfreq: -5.5337 -0.0010 -0.0008 -0.0006 3.7174 7.2486 64.4401 86.0544 105.2606
frequency: 64.4357 86.0239 105.2581 144.8759 173.0355 175.9100 187.3886 198.1404 208.0249 237.1549 267.1431 268.8258 336.5615 341.0157 361.7330 413.5287 487.6120 524.1460 562.8957 564.1174 632.1812 661.5794 735.5497 778.7383 829.7768 856.7906 885.3331 936.3482 981.2405 1001.3465 1024.0548 1042.0325 1078.6031 1110.3849 1111.5269 1143.6447 1157.5211 1164.3651 1192.1810 1250.4732 1301.3882 1365.5234 1396.6072 1408.6714 1417.1672 1437.3347 1441.6505 1447.2961 1461.3232 1467.0415 1468.2246 1468.4080 1474.5387 1482.1741 1560.6093 1594.3421 1614.0376 2959.8755 2968.2730 2969.8100 2990.6309 3059.8378 3061.9489 3078.2642 3090.2615 3130.5657 3130.7485 3157.2367 3186.7912
redmass: 4.3759 3.0336 3.9852 1.5861 3.5397 1.6978 1.7989 4.6599 1.5212 1.4209 3.8447 1.7523 3.6889 4.1295 4.6818 4.2877 5.9462 4.9766 3.1885 5.8057 4.2057 4.3350 2.4409 4.2525 1.3618 1.9463 7.2300 6.8524 1.7672 1.8711 4.5371 1.6138 3.0259 1.2591 1.2577 1.8165 1.4111 1.8501 2.4309 1.6297 5.9054 2.6910 1.3878 1.8366 1.5931 1.2687 1.3018 1.0457 1.7287 1.0499 1.1772 1.0501 1.1595 1.5716 8.1595 5.4899 6.2484 1.0855 1.0325 1.0324 1.0366 1.1043 1.1044 1.0954 1.1014 1.1004 1.1002 1.0911 1.0915
irintensity: 0.2967 11.0234 0.6444 5.7386 7.0379 8.1324 4.1778 0.1995 0.0219 0.2610 4.1119 1.3707 5.3319 2.4430 1.4701 1.8242 23.2307 0.5864 0.0436 31.2894 3.4461 2.7200 5.5515 18.3392 0.3739 59.6689 3.3995 0.0331 4.4815 32.7018 34.7286 8.5850 80.2466 0.0966 0.1664 139.9230 11.8028 151.1078 34.5207 21.0835 161.8399 42.9062 73.0815 90.5002 6.7764 1.9266 16.3134 12.9416 13.1720 12.7912 80.1933 14.9519 52.7009 0.9738 126.9921 368.5399 251.8823 72.9700 56.1476 55.3143 19.4346 38.2331 44.4377 7.9006 22.5481 24.0608 17.2296 10.0682 1.7263
temp: 298.150 k
press: 1.00000 atm
elementType: 8 8 8 6 6 6 6 6 6 6 6 6 6 1 1 1 1 1 1 1 1 1 1 1 1
symmnumber: 1
zpe: 519610.4 jmol-1
zpe.correction: 0.197909 hartree
zpe.thermalcorrener: 0.211310 hartree
zpe.thermalcorrenthalpy: 0.212254 hartree
zpe.thermalcorrgfe: 0.158473 hartree
zpe.sumelectzpe: -612.928566 hartree
zpe.sumelectthermal: -612.915165 hartree
zpe.sumelectthermalent: -612.914221 hartree
zpe.sumelectthermalfe: -612.968002 hartree
dipole: -4.9786 2.4214 0.0003
dipole: 5.5362
quadrupole: -78.8788 -66.4912 -78.4694
quadrupole: 15.4006 0.0071 -0.0046
quadrupole: -4.2656 8.1219 -3.8563 15.4006 0.0071 -0.0046
hfenergy: -613.1264749 hartree
pointgroup: C01 [X(C10H12O3)]
dipole: 2.0259433 0.7973397 0.0630656 debye
dipolederiv: -0.4645713 0.5881467 0.0052881 0.3333986 -1.5221558 -0.0119984 0.0011244 -0.0058258 -0.2887591 -1.9185297 0.1556778 -0.0375756 -0.0167369 -0.3599143 -0.0014328 -0.0409097 0.0029879 -0.2989389 -1.0338439 -0.2268923 -0.0210411 -0.6605596 -0.7113789 -0.0224148 -0.0278778 -0.011612 -0.3290088 0.666105 0.1766636 0.0182989 -0.182409 0.4049997 0.0014219 0.012568 0.0103202 0.0437478 -1.1909076 -0.1585863 -0.0301889 0.2118271 -0.4922877 -0.001594 -0.0243209 -0.0107761 -0.072448 0.8433362 -0.7421142 0.0061272 -0.083227 1.136462 0.0148843 0.0168195 -0.0014249 0.1017903 -0.6536756 -0.2656948 -0.0141091 -0.5045938 -0.3837103 -0.0144471 -0.0179648 -0.0085154 -0.2625191 1.7280812 -0.0884481 0.0377229 0.3877634 0.5735868 0.016618 0.0456607 0.0047374 0.1488733 -0.7685531 0.3931856 -0.0065741 0.2608002 -0.2597397 0.0061095 -0.0088069 0.0094282 -0.242705 0.0398677 -0.2515607 -0.0033776 -0.1200139 -0.1457209 -0.0054923 -0.0012193 -0.0087222 0.0088712 1.7078671 0.313475 0.0450567 0.3651922 0.7190522 0.018885 0.0458268 0.0175945 0.0896657 0.1885075 0.1955231 0.000023 -0.0861844 0.8615579 0.0067513 -0.0046583 0.0138228 0.3173037 0.733096 -0.1302042 0.008071 -0.5163735 0.3411525 -0.0122673 0.0020787 -0.0027315 0.3153229 0.0136076 0.0740012 -0.0025588 0.11261 -0.0272235 -0.000409 -0.0019171 -0.001338 0.1667833 0.0905308 -0.0570489 -0.0031758 -0.0567013 -0.0247075 -0.0047544 -0.0031892 -0.0047713 0.1812027 0.0476058 -0.0244205 0.0909556 0.0035636 0.0541546 0.002269 0.0716473 0.0372838 -0.0070624 0.0554339 -0.0196432 -0.0885913 0.0059269 0.0553604 0.000171 -0.0684099 -0.0361876 -0.0162546 -0.0626953 0.2057436 -0.0006095 0.0681635 -0.0403339 -0.0006271 -0.0028809 0.0027485 0.0993591 -0.0012425 0.0817274 -0.0015372 0.1678025 -0.111944 0.0006416 -0.0000931 -0.0014953 0.1129552 0.0247595 -0.1476411 0.1175495 0.0093386 -0.021169 -0.0041214 0.0915333 0.0521338 -0.0738391 0.0347293 -0.1410274 -0.117027 0.0120659 -0.019367 0.0068073 -0.085834 -0.0570998 -0.0854373 -0.0337093 0.1432449 -0.0014079 0.0802144 -0.0306241 -0.0006525 -0.0024698 0.0008772 0.1249661 -0.1391956 -0.0401168 -0.0075256 -0.0925628 0.0599458 -0.0036159 -0.0084516 -0.0022254 0.1242896 0.0478694 -0.0132161 -0.0570273 0.1529614 -0.024478 -0.0968348 0.015926 -0.1020055 -0.0839674 0.0455269 -0.0207744 0.0632337 0.1477339 -0.0315173 0.1061026 -0.0041814 0.1027964 -0.0741913 unknown
polarizability: 173.5493142|1.9956328|143.6247085|2.7752836|1.3734487|62.5614074 unknown
InChI: InChI=1S/C10H12O3/c1-7-4-8(12-2)5-10(13-3)9(7)6-11/h4-6H,1-3H3
charge 0 multiplicity 1
25 atoms
O  -1.440182 2.094386 -0.036766
O  3.065308 0.368359 0.046594
O  -3.252136 -1.489292 -0.139403
C  -0.242324 -1.424571 -0.064719
C  -1.120747 -0.291535 -0.067933
C  -0.535874 1.026091 -0.031966
C  1.158056 -1.228932 -0.026878
C  1.699169 0.078388 0.007874
C  0.856184 1.214955 0.00558
C  -0.767907 -2.846642 -0.101002
C  -2.591915 -0.404811 -0.106136
C  -0.902987 3.458086 -0.000666
C  4.00885 -0.756102 0.051982
H  1.810417 -2.106443 -0.025151
H  1.320163 2.202854 0.033165
H  -1.434517 -3.051151 0.75477
H  -1.391407 -3.022311 -0.994837
H  0.067553 -3.568222 -0.092298
H  -3.127645 0.569261 -0.104023
H  -0.273969 3.663388 -0.887745
H  -0.317679 3.632662 0.922181
H  -1.787269 4.111453 -0.010959
H  5.004734 -0.291414 0.086263
H  3.910175 -1.364708 -0.866778
H  3.86245 -1.39605 0.942647
