program: Gaussian 09
title: 000251672
version: EM64L-G09RevD.01
frameworkgroup: C1[X(C7H6BrNO2)]
method: RPBEPBE
basis: SDD
operation: Freq
keyword: #p
keyword: freq=noraman
keyword: PBEPBE/SDD
title: #p freq=noraman PBEPBE/SDD
converged: NO NO NO NO
title: Mulliken charges:
elementType: Br O O N C C C C C C C H H H H H H
charge: 0.044031 -0.204595 -0.204923 0.021198 0.582105 -0.535248 0.403187 -0.397778 -0.371902 -0.131595 -0.807991 0.296208 0.294685 0.260664 0.256947 0.256947 0.238061
chargesum: 0.00000
title: Mulliken charges with hydrogens summed into heavy atoms:
elementType: Br O O N C C C C C C C
charge: 0.044031 -0.204595 -0.204923 0.021198 0.582105 -0.239041 0.403187 -0.397778 -0.077217 0.129069 -0.056036
polarizability: 1.79618423e+02 -1.31502459e+00 1.10799584e+02 1.83230598e-03 1.18693708e-03 4.32747145e+01
1716.lowfreq: -9.6404 -7.4686 -6.0198 0.0007 0.0007 0.0007 59.6158 75.1363 126.5226
frequency: 59.5897 75.1322 126.5062 162.6807 191.1879 220.3822 241.4153 276.6756 370.4299 438.3986 461.9950 517.1947 518.2484 545.0630 666.5203 679.7288 722.7044 745.3029 837.2757 895.6159 925.2103 980.2095 995.8466 1013.5012 1051.2962 1095.3391 1131.0131 1209.9625 1217.8603 1263.2619 1366.8871 1376.4189 1404.3020 1411.1184 1452.0032 1461.8808 1472.7365 1575.2961 1606.5706 2990.9630 3070.1764 3106.3995 3170.8339 3172.6135 3193.1652
redmass: 9.7260 8.6406 1.0469 10.9586 3.2784 4.5859 11.5096 5.6016 4.8047 2.9814 6.8701 4.3379 5.0826 5.9463 7.6530 5.2291 3.9917 9.8164 1.3741 5.1261 1.3863 1.3506 1.8027 3.7668 1.5448 1.8159 1.4798 3.7429 4.4890 1.3951 7.5027 5.3260 1.2403 4.3251 2.8909 1.0439 1.1591 6.1134 8.3862 1.0375 1.0972 1.0996 1.0903 1.0919 1.0968
irintensity: 0.3548 2.3602 0.6500 2.9961 0.1574 1.4263 0.5373 6.6644 1.5715 8.1980 10.3493 0.1634 3.2916 3.9767 0.9746 11.6619 9.2076 28.9262 28.5323 24.8529 17.4066 3.2166 4.3752 99.0044 13.1652 7.2414 8.1676 111.5630 245.7664 17.5406 76.4978 28.6496 19.5978 28.6196 55.8968 15.1114 22.1875 65.8653 10.6091 11.2721 9.5372 13.8300 1.8452 2.2877 2.7120
temp: 298.150 k
press: 1.00000 atm
elementType: 35 8 8 7 6 6 6 6 6 6 6 1 1 1 1 1 1
symmnumber: 1
zpe: 307840.5 jmol-1
zpe.correction: 0.117250 hartree
zpe.thermalcorrener: 0.127433 hartree
zpe.thermalcorrenthalpy: 0.128377 hartree
zpe.thermalcorrgfe: 0.079947 hartree
zpe.sumelectzpe: -488.129952 hartree
zpe.sumelectthermal: -488.119769 hartree
zpe.sumelectthermalent: -488.118825 hartree
zpe.sumelectthermalfe: -488.167255 hartree
dipole: -4.0427 0.5127 -0.0008
dipole: 4.0750
quadrupole: -95.7943 -65.8165 -73.7683
quadrupole: -1.1950 -0.0034 0.0003
quadrupole: -17.3346 12.6432 4.6914 -1.1950 -0.0034 0.0003
hfenergy: -488.2472018 hartree
pointgroup: C01 [X(C7H6Br1N1O2)]
dipole: -1.6024463 0.0505127 -0.0002963 debye
dipolederiv: -0.7770168 -0.1207267 0.0000122 -0.1265164 -0.0517829 0.0000012 0.0000515 0.0000247 -0.0084096 -0.8415171 0.1956102 0.0000323 0.2440703 -0.6078139 -0.0001078 -0.0001919 0.0000808 -0.2282193 -0.7155118 -0.1925892 -0.0000142 -0.2640434 -0.7188205 0.0000868 -0.0001863 -0.0001911 -0.22737 1.9493783 0.0801513 0.0000644 0.114949 1.0906587 0.0000279 0.0002602 0.000095 0.1883883 -0.3496231 -0.4614656 -0.00001 -0.4122443 0.1222466 -0.0000113 -0.0000294 -0.000003 0.0395536 0.20374 0.2534244 -0.0000098 -0.2292062 -0.1184404 -0.0000122 0.000132 0.0000687 -0.1232333 -0.7683438 -0.1007682 -0.0000665 -0.0991916 0.0624441 0.0000148 -0.0000331 -0.000024 0.074774 1.3939254 0.264312 -0.0000233 0.284355 0.0700889 0.0000053 0.0000226 0.0000226 -0.1512142 0.1854672 -0.0623695 -0.0000211 0.3110337 -0.0555887 0.0000106 0.000129 0.0000368 -0.1165946 -0.5451754 0.1005676 0.0000115 0.1068019 0.0469458 0.0000093 -0.0001488 -0.0001028 -0.070367 -0.0754032 0.1664354 0.0000037 0.1255106 -0.0197236 -0.0000108 0.0000812 0.000055 0.0380289 0.108208 -0.0409637 0.0000133 -0.0063484 0.0423673 -0.0000008 -0.0000191 -0.0000257 0.1680109 0.0826047 0.0531898 0.0000113 0.0124211 0.0795726 -0.0000172 0.0000076 0.0000077 0.1791253 0.0614543 -0.0523414 0.0000009 -0.0471067 -0.0081801 0.0000017 0.0000133 0.000015 0.1559757 0.0336518 0.0365975 -0.0908716 0.0146892 0.0599029 -0.0294471 -0.0953259 0.0139472 -0.016681 0.0336973 0.0366137 0.0908768 0.0146681 0.0598978 0.0294575 0.0952426 -0.0139929 -0.0166795 0.0204642 -0.1556775 -0.0000097 -0.0438418 -0.0537745 -0.0000079 -0.0000054 -0.0000139 0.1149117 unknown
polarizability: 179.2514229|5.1818057|111.1665844|0.001712|0.0013548|43.2747145 unknown
InChI: InChI=1S/C7H6BrNO2/c1-5-4-6(9(10)11)2-3-7(5)8/h2-4H,1H3
charge 0 multiplicity 1
17 atoms
Br -3.722298 -0.765851 -0.000003
O  3.177026 -0.979798 0.000305
O  2.879154 1.283964 0.000359
N  2.429653 0.073261 -0.000019
C  -1.283605 0.866034 0.000009
C  0.124504 1.012897 0.0000
C  0.959531 -0.122372 -0.000025
C  -1.787214 -0.464436 -0.000015
C  0.447691 -1.435786 -0.000075
C  -0.950222 -1.601316 -0.000055
C  -2.182555 2.082962 0.000056
H  0.580031 2.007157 0.000039
H  1.129351 -2.289443 -0.000105
H  -1.386942 -2.603225 -0.000072
H  -2.842249 2.090538 -0.886494
H  -2.842277 2.090454 0.886586
H  -1.589878 3.011459 0.000109
