program: Gaussian 09
title: 000251697
version: EM64L-G09RevD.01
frameworkgroup: C1[X(C18H19NO5)]
method: RPBEPBE
basis: SDD
operation: Freq
keyword: #p
keyword: freq=noraman
keyword: PBEPBE/SDD
title: #p freq=noraman PBEPBE/SDD
converged: YES YES NO NO
title: Mulliken charges:
elementType: O O O O O N C C C C C C C C C C C C C C C C C C H H H H H H H H H H H H H H H H H H H
charge: -0.336663 -0.402490 -0.269994 -0.235000 -0.285969 -0.446104 -0.663266 -0.083689 0.395033 0.229104 -0.393633 0.184562 -0.503037 -0.384835 0.188442 0.335697 0.253547 -0.351584 -0.327613 -0.534451 -0.226445 -0.247859 -0.232930 -0.535824 0.255292 0.244507 0.294014 0.376747 0.240866 0.265169 0.244574 0.275717 0.209919 0.380541 0.237836 0.235753 0.233555 0.230949 0.226169 0.230150 0.245894 0.224900 0.222450
chargesum: 0.00000
title: Mulliken charges with hydrogens summed into heavy atoms:
elementType: O O O O O N C C C C C C C C C C C C C C C C C C
charge: -0.336663 -0.021948 -0.269994 -0.235000 -0.285969 -0.069356 -0.163468 0.210325 0.395033 0.229104 -0.152767 0.184562 -0.237868 -0.140261 0.188442 0.335697 0.253547 -0.075866 -0.117694 0.172693 0.004504 -0.021690 -0.002781 0.157420
polarizability: 2.44012541e+02 -1.37601441e+01 2.38562723e+02 1.59202010e+01 -1.70959037e+01 1.77579671e+02
1716.lowfreq: -9.2495 -3.2090 -0.0007 -0.0005 -0.0003 4.3632 11.4013 15.2942 38.1361
frequency: 10.7366 15.0200 38.1082 44.0873 48.2258 60.3746 78.3170 90.3885 95.1107 102.7939 133.4894 154.2053 166.7811 196.3193 197.8921 213.2658 231.6835 247.3681 270.3102 291.2904 307.3105 308.9938 342.2569 390.4815 401.7619 413.8294 416.5267 453.3150 477.0876 497.2111 510.1201 554.1727 567.6578 574.8005 610.8431 614.3693 619.9233 667.5445 670.2905 681.4476 697.1068 703.3003 704.5492 724.0120 774.9503 794.5285 797.5213 842.3959 849.0378 854.2891 858.0076 884.7516 891.0443 933.6160 939.1831 981.6003 986.9330 989.8962 1004.3186 1014.7156 1023.4725 1027.6993 1076.6402 1078.8565 1087.3305 1111.7020 1112.7872 1116.3872 1140.1293 1155.7174 1160.2351 1171.9306 1177.8250 1188.5904 1194.6766 1203.7230 1255.3817 1261.4036 1285.9240 1296.2260 1316.1073 1320.4639 1331.4801 1347.6370 1384.2033 1392.4873 1416.1620 1432.2711 1434.1331 1445.3770 1462.5151 1465.7535 1466.8877 1470.8623 1473.4301 1475.8222 1499.9477 1515.4938 1565.9367 1587.5598 1602.0441 1611.6412 1624.2465 1653.4922 2962.8176 2972.7752 3006.6357 3019.0035 3051.7859 3067.2722 3074.4143 3120.3869 3124.7754 3127.1138 3129.4694 3130.9373 3142.6685 3155.7663 3167.7348 3171.7794 3181.1790 3443.1293 3514.6967
redmass: 4.6725 4.4110 6.3982 5.3932 6.3834 6.0668 5.5192 3.8325 4.7198 3.7953 6.2169 4.8342 4.4715 2.0484 2.0298 4.4403 1.4033 2.6858 2.3942 3.8921 6.3984 4.6645 3.7907 4.5011 2.8147 5.2678 4.1400 3.1640 4.7855 4.3647 4.7900 3.2772 3.3531 2.5007 2.7048 6.3494 3.5931 4.0377 3.2733 1.7194 2.2589 2.0281 2.9610 3.2947 4.2858 2.4100 1.4891 4.4811 1.7087 1.2786 4.8625 5.6759 2.1900 1.4511 1.3978 1.4220 8.2125 5.6742 1.3424 3.4862 2.6292 2.6725 2.1561 2.3164 2.1172 1.2732 2.1957 1.3628 1.5374 1.5434 1.6804 1.0619 1.6706 1.1393 1.5218 1.9045 2.2257 2.2236 1.3948 2.1810 1.3512 1.4514 2.2515 1.3208 9.1324 4.4667 2.4996 2.2086 1.1808 1.4067 1.1983 1.0555 1.0502 1.1047 1.1906 1.5593 2.6121 1.9985 5.8770 7.7190 6.4064 6.0168 6.9279 9.0387 1.0328 1.0317 1.0649 1.0789 1.1041 1.1047 1.1024 1.0853 1.1011 1.0988 1.0907 1.0880 1.0930 1.0957 1.1002 1.0940 1.0911 1.0814 1.0640
irintensity: 0.4366 0.0273 2.2205 1.8018 0.3966 0.4231 6.9641 6.7155 0.4895 5.1282 0.9922 1.5339 2.2230 3.2652 1.0534 3.5307 1.1626 3.1326 2.8574 1.3709 3.8619 2.2389 2.8671 1.0646 0.0523 0.2890 5.4901 2.1936 18.3497 11.2819 17.1964 10.9677 34.4704 64.1359 39.9830 0.8992 30.8303 22.3383 23.2928 99.6733 10.1040 91.8230 70.2399 0.7783 5.3000 21.7872 24.1218 6.9442 54.0553 3.0326 14.2240 9.3442 34.9513 3.4588 2.9278 1.2558 28.7805 0.0909 1.4089 88.7897 5.6773 5.8150 7.3446 166.8838 27.4898 3.5525 125.3890 20.5323 19.2827 43.7375 12.2840 2.9192 70.7233 6.2341 4.4325 16.4857 68.2383 29.4848 21.6827 105.0100 3.5076 1.1249 66.4667 5.3658 1.4363 30.7870 9.1279 3.0220 16.1872 15.2693 74.0083 37.3087 15.9024 63.9896 63.6302 18.5037 179.3061 264.7949 84.6310 39.6433 35.7727 4.9307 142.0730 254.6889 69.0358 43.9436 13.9035 8.2794 44.7985 41.2755 8.3067 6.3386 21.5240 29.5291 3.6611 4.4486 31.2828 17.1505 20.9162 10.2442 1.2737 246.6703 27.9333
temp: 298.150 k
press: 1.00000 atm
elementType: 8 8 8 8 8 7 6 6 6 6 6 6 6 6 6 6 6 6 6 6 6 6 6 6 1 1 1 1 1 1 1 1 1 1 1 1 1 1 1 1 1 1 1
symmnumber: 1
zpe: 885107.4 jmol-1
zpe.correction: 0.337120 hartree
zpe.thermalcorrener: 0.360251 hartree
zpe.thermalcorrenthalpy: 0.361195 hartree
zpe.thermalcorrgfe: 0.281209 hartree
zpe.sumelectzpe: -1126.436205 hartree
zpe.sumelectthermal: -1126.413073 hartree
zpe.sumelectthermalent: -1126.412129 hartree
zpe.sumelectthermalfe: -1126.492115 hartree
dipole: -3.6564 -4.5150 3.1801
dipole: 6.6232
quadrupole: -120.7090 -141.4925 -133.5614
quadrupole: -7.5647 15.1439 3.9618
quadrupole: 11.2120 -9.5715 -1.6405 -7.5647 15.1439 3.9618
hfenergy: -1126.7733242 hartree
pointgroup: C01 [X(C18H19N1O5)]
dipole: 1.3247736 -1.4967914 -1.6717028 debye
polarizability: 246.2864224|12.2347267|229.6031382|14.1813466|26.7304291|184.2653736 unknown
InChI: InChI=1S/C18H19NO5/c1-23-14-9-8-13(16(11-14)24-2)10-15(18(21)22)19-17(20)12-6-4-3-5-7-12/h3-9,11,15,19,21H,10H2,1-2H3
charge 0 multiplicity 1
43 atoms
O  0.647267 -0.164995 -1.901593
O  -2.320852 3.23839 -0.217007
O  4.788906 -1.991003 -0.158491
O  -0.878392 4.332243 1.237428
O  -2.366097 0.922327 2.140491
N  -1.102703 0.825617 0.20554
C  0.859128 2.230953 -0.38905
C  -0.34928 2.019516 0.578689
C  1.89962 1.126178 -0.304693
C  1.79519 -0.069745 -1.076694
C  3.022117 1.247292 0.540279
C  -1.194006 3.301841 0.603957
C  2.769577 -1.082092 -1.010078
C  4.017444 0.247102 0.637834
C  -2.101469 0.350707 1.0314
C  3.882633 -0.920613 -0.147735
C  -2.846014 -0.874887 0.568169
C  -3.563648 -1.611775 1.544208
C  -2.885988 -1.297214 -0.786461
C  0.556507 -1.307707 -2.819153
C  -4.289625 -2.764372 1.179485
C  -3.619202 -2.447411 -1.152832
C  -4.316946 -3.188319 -0.170581
C  5.954571 -1.898171 0.725168
H  0.473085 2.318773 -1.42135
H  1.326565 3.194032 -0.11942
H  0.028799 1.914807 1.613529
H  -0.81348 0.338629 -0.650675
H  3.126467 2.159944 1.13923
H  2.702633 -2.004074 -1.592096
H  4.869544 0.392152 1.306634
H  -3.540989 -1.25144 2.577926
H  -2.384662 -0.712192 -1.566703
H  -2.824072 4.093658 -0.136561
H  -0.354049 -1.132374 -3.411235
H  1.436134 -1.343712 -3.488118
H  0.465949 -2.259937 -2.263311
H  -4.836597 -3.329298 1.942346
H  -3.658323 -2.758607 -2.202915
H  -4.885645 -4.080307 -0.456492
H  6.512013 -2.832152 0.562944
H  5.64879 -1.824567 1.786694
H  6.591398 -1.031998 0.460291
