program: Gaussian 09
title: 000251694
version: EM64L-G09RevD.01
frameworkgroup: C1[X(C19H15NO5)]
method: RPBEPBE
basis: SDD
operation: Freq
keyword: #p
keyword: freq=noraman
keyword: PBEPBE/SDD
title: #p freq=noraman PBEPBE/SDD
converged: YES YES NO NO
title: Mulliken charges:
elementType: O O O O O N C C C C C C C C C C C C C C C C C C C H H H H H H H H H H H H H H H
charge: -0.271039 -0.304339 -0.274709 -0.197585 -0.183533 -0.104480 0.394505 0.090045 -0.279010 0.038438 0.194194 -0.393574 0.099582 0.296908 -0.340923 -0.246984 0.126684 -0.368617 -0.336071 -0.220968 -0.225377 -0.228061 0.224809 -0.516693 -0.741283 0.245228 0.307948 0.261244 0.239337 0.268178 0.272171 0.232827 0.234089 0.234174 0.240637 0.229996 0.238439 0.253661 0.260109 0.250043
chargesum: 0.00000
title: Mulliken charges with hydrogens summed into heavy atoms:
elementType: O O O O O N C C C C C C C C C C C C C C C C C C C
charge: -0.271039 -0.304339 -0.274709 -0.197585 -0.183533 -0.104480 0.394505 0.090045 -0.033781 0.038438 0.194194 -0.085626 0.099582 0.296908 -0.079679 -0.007647 0.126684 -0.100439 -0.063900 0.011859 0.008712 0.006112 0.224809 0.192379 0.022529
polarizability: 5.26819163e+02 -3.02460282e+01 2.50827397e+02 -8.87609141e+00 -1.35007740e+01 1.10353196e+02
1716.lowfreq: -4.7175 -2.7350 -0.0003 0.0004 0.0009 2.5756 23.3060 24.5540 37.5819
frequency: 23.2989 24.5023 37.5706 44.9739 48.1666 63.2483 71.9325 79.0174 84.7908 99.0576 132.8672 145.1371 183.5844 199.1622 206.1874 208.2053 242.2662 268.9839 272.2674 295.9434 334.0476 352.5495 386.4953 394.9953 403.5931 410.8490 448.9161 484.2788 508.7023 516.0650 544.3087 564.0729 572.4797 599.3451 611.8086 634.8290 653.1602 672.4888 678.8584 697.2196 722.0854 739.2692 749.4902 762.3914 775.4450 785.5689 810.6570 813.3271 854.5375 861.0464 892.5618 926.8556 947.3163 953.6517 960.3392 983.4231 988.1027 993.1734 999.0243 1006.8362 1014.3152 1031.6500 1038.4468 1045.6441 1068.1186 1085.0197 1110.1943 1131.7083 1135.2239 1157.5838 1172.8473 1174.7720 1186.8526 1197.0674 1250.3142 1270.8974 1300.3611 1321.3882 1349.4536 1384.8522 1387.6588 1393.4292 1427.7377 1437.4531 1438.9756 1449.4335 1451.3657 1463.4238 1467.8962 1470.1706 1481.8722 1534.1299 1574.8344 1584.0578 1590.4430 1609.6488 1639.3150 1684.6644 1687.4325 2984.5217 3006.6411 3089.4737 3093.4694 3120.8710 3132.2817 3140.2310 3144.2253 3145.4153 3149.2687 3156.7453 3167.1901 3169.0384 3175.6023 3178.0427
redmass: 5.3911 4.6941 3.8662 3.0679 2.6295 4.7680 2.9463 3.7696 2.5635 6.1288 5.2745 8.3345 5.5083 5.4063 7.0966 4.7210 1.3266 6.2260 3.0643 3.7493 6.4848 4.9308 6.8093 4.7413 2.8850 5.6981 5.3406 3.9746 4.2888 6.5029 3.6653 5.2923 5.3284 4.7833 6.5232 6.8272 7.1600 6.1586 5.9535 1.7449 4.6671 8.5763 8.8213 5.5149 4.7666 1.9311 7.0814 1.8751 7.1952 1.2469 7.4474 1.3526 1.4199 4.2261 1.7775 2.1577 6.2133 1.3845 1.3367 1.3309 4.2982 2.6046 1.6728 3.1827 2.9101 1.7198 1.2405 2.5292 4.8388 1.4813 2.7408 1.0583 1.1175 1.2886 2.8278 3.5924 2.4468 1.3594 2.5686 1.2525 8.6171 3.1286 1.7119 2.0213 2.2494 1.0638 1.0478 1.8664 1.1487 2.3612 1.0519 6.9469 5.4536 6.1763 7.3269 6.1590 8.7234 10.7531 11.0312 1.0305 1.0376 1.1049 1.0964 1.1026 1.0855 1.0854 1.0890 1.1012 1.0876 1.0935 1.0965 1.0931 1.1003 1.0997
irintensity: 1.0800 0.0616 1.6871 0.8363 3.8454 0.9539 0.1178 4.3214 4.7228 3.7147 0.2554 0.9097 2.3532 0.4293 4.9155 0.8607 1.1934 3.2374 2.6393 2.7708 4.0278 2.0967 2.8227 1.9434 0.1737 10.0895 3.6301 0.1846 2.4927 2.4657 2.1807 9.5923 2.8807 1.5028 2.6807 17.1784 1.6773 23.5833 7.6617 59.2184 5.0811 15.0875 4.2425 43.9791 57.7177 41.3988 185.2446 57.9404 77.3692 0.0132 10.1970 0.3399 5.0001 55.3435 17.4542 66.8889 0.9824 0.0072 2.6781 0.3165 15.8469 37.8743 7.8062 131.6407 44.1792 14.2041 1.8966 61.9305 200.4245 4.5213 125.9999 0.1485 16.7762 17.4201 248.5173 55.3502 125.8954 6.1681 3.3990 70.8101 1.7714 42.6207 50.4814 2.4602 54.2556 25.2503 12.2180 67.8730 30.8920 35.0866 37.1542 19.7080 107.6388 0.3352 7.6562 13.8740 315.7096 134.2893 184.4258 63.7984 0.6979 30.9340 6.3033 29.7651 0.3309 10.8759 10.3229 7.1226 8.8706 21.6824 14.4717 5.9174 25.8035 23.0342
temp: 298.150 k
press: 1.00000 atm
elementType: 8 8 8 8 8 7 6 6 6 6 6 6 6 6 6 6 6 6 6 6 6 6 6 6 6 1 1 1 1 1 1 1 1 1 1 1 1 1 1 1
symmnumber: 1
zpe: 776250.8 jmol-1
zpe.correction: 0.295658 hartree
zpe.thermalcorrener: 0.318271 hartree
zpe.thermalcorrenthalpy: 0.319216 hartree
zpe.thermalcorrgfe: 0.240866 hartree
zpe.sumelectzpe: -1162.111954 hartree
zpe.sumelectthermal: -1162.089341 hartree
zpe.sumelectthermalent: -1162.088397 hartree
zpe.sumelectthermalfe: -1162.166747 hartree
dipole: 0.2216 4.4310 -1.3248
dipole: 4.6302
quadrupole: -110.4130 -131.3919 -154.7134
quadrupole: -0.0049 -0.0093 -2.8322
quadrupole: 21.7598 0.7809 -22.5406 -0.0049 -0.0093 -2.8322
hfenergy: -1162.4076124 hartree
pointgroup: C01 [X(C19H15N1O5)]
dipole: -0.0045462 -1.6052243 0.8611738 debye
polarizability: 525.7688525|28.3264444|238.7669449|29.8614167|-38.1334807|123.4639577 unknown
InChI: InChI=1S/C19H15NO5/c1-12(21)24-17-14(9-6-10-16(17)23-2)11-15-19(22)25-18(20-15)13-7-4-3-5-8-13/h3-11H,1-2H3
charge 0 multiplicity 1
40 atoms
O  -2.637318 1.874127 -0.721496
O  2.819973 -1.13534 1.08404
O  5.539728 0.052618 0.905155
O  -0.682031 3.137182 -1.013108
O  2.70435 -2.098457 -1.057173
N  -1.790882 -0.055914 0.238755
C  1.908896 0.986426 0.197359
C  3.045223 0.183925 0.567079
C  0.591114 0.383734 0.313801
C  -0.686516 0.811151 -0.012533
C  4.360958 0.704945 0.531302
C  2.140463 2.332959 -0.216374
C  -2.879414 0.572838 -0.175885
C  -4.260319 0.107015 -0.145978
C  4.546072 2.056728 0.137479
C  3.447534 2.854757 -0.232376
C  -1.197204 2.074395 -0.625805
C  -4.549906 -1.182796 0.381211
C  -5.314582 0.92572 -0.636733
C  -5.879275 -1.643892 0.414786
C  -6.64283 0.454944 -0.598764
C  -6.929488 -0.827684 -0.074362
C  2.590751 -2.216739 0.173388
C  5.684676 -1.406755 0.761398
C  2.210291 -3.450528 0.954631
H  0.573092 -0.617042 0.762091
H  1.29426 2.955173 -0.515293
H  5.570132 2.442064 0.126216
H  3.61375 3.891128 -0.542456
H  -3.724427 -1.797894 0.753316
H  -5.080762 1.915679 -1.039877
H  -6.101541 -2.636879 0.819997
H  -7.454154 1.08588 -0.976988
H  -7.963073 -1.190053 -0.046728
H  5.327126 -1.74477 -0.228256
H  5.154818 -1.940731 1.568272
H  6.767709 -1.583942 0.844819
H  2.177718 -4.321281 0.284611
H  1.216382 -3.307713 1.415677
H  2.926304 -3.624681 1.7755
