program: Gaussian 09
title: 000251662
version: EM64L-G09RevD.01
frameworkgroup: C1[X(C11H17NO)]
method: RPBEPBE
basis: SDD
operation: Freq
keyword: #p
keyword: freq=noraman
keyword: PBEPBE/SDD
title: #p freq=noraman PBEPBE/SDD
converged: YES YES NO NO
title: Mulliken charges:
elementType: O N C C C C C C C C C C C H H H H H H H H H H H H H H H H H
charge: -0.249301 -0.060497 -0.358803 -0.354373 -0.395501 -0.391777 -0.399289 -0.480319 0.340688 -0.407275 0.329170 -0.389247 -0.787891 0.233126 0.161347 0.161517 0.209855 0.208031 0.190260 0.189766 0.207139 0.187479 0.212682 0.223417 0.195807 0.255384 0.252550 0.242350 0.233440 0.240266
chargesum: 0.00000
title: Mulliken charges with hydrogens summed into heavy atoms:
elementType: O N C C C C C C C C C C C
charge: -0.249301 -0.060497 0.035670 0.017000 0.002789 0.005128 0.000872 -0.061095 0.340688 -0.151891 0.329170 -0.136697 -0.071835
polarizability: 1.54677487e+02 7.00375066e+00 1.12305447e+02 8.51947465e+00 -7.07653629e+00 1.08538103e+02
1716.lowfreq: -20.3453 -7.2349 -0.0005 -0.0003 0.0005 13.1603 27.2697 39.7415 67.5474
frequency: 24.3835 38.9204 67.4725 110.4524 132.7387 189.0052 227.3663 251.0029 278.7884 295.4781 307.4200 376.1813 378.7342 447.2031 451.6269 548.0556 611.5472 613.3556 647.1836 739.2264 755.3975 802.1914 805.6722 850.2715 854.8145 858.9270 879.3470 910.6391 934.4699 958.0275 977.4951 985.3589 994.9120 1026.8476 1044.4719 1047.2923 1079.4149 1095.7650 1122.4135 1145.0714 1150.8895 1171.6630 1201.4233 1211.4905 1232.1971 1256.0515 1264.7786 1272.8800 1288.8308 1328.5583 1335.6307 1340.2056 1344.2002 1349.5736 1363.5098 1389.2530 1405.0764 1446.0679 1448.8279 1455.7265 1458.2175 1465.4292 1466.7100 1472.4915 1478.4090 1570.9417 1607.8442 2802.4103 2813.3835 2844.1568 2965.5577 2981.5199 2985.2796 2986.4078 3006.2079 3017.3103 3031.7420 3038.2427 3045.8376 3055.0027 3057.0667 3101.3096 3213.0576 3232.6271
redmass: 3.1199 3.4065 3.2674 1.1237 2.9835 4.0871 1.9219 2.3373 3.4525 1.9748 4.3354 1.7235 2.4119 2.8795 2.9803 1.9661 3.8788 3.7052 4.2779 4.2997 3.5455 1.3477 1.3533 2.0149 1.7466 1.4312 2.6689 2.8667 4.8849 1.2995 2.1690 2.0136 2.1577 1.2627 2.1903 1.4612 1.3964 2.3452 2.5489 2.1937 1.3315 1.6124 3.7338 1.4574 3.8527 1.3523 1.2389 1.3806 1.3789 1.2941 1.4432 1.4520 2.1863 1.5820 1.4413 1.4672 1.2485 1.0868 1.0922 1.0438 1.0876 1.0845 1.0923 1.0922 1.0962 7.6318 6.2549 1.0716 1.0705 1.0698 1.0625 1.0377 1.0617 1.0613 1.0865 1.0865 1.0949 1.0883 1.1033 1.1034 1.0982 1.0976 1.0939 1.1039
irintensity: 0.1271 0.3027 0.6990 0.1523 2.4179 6.5818 0.6460 0.1816 0.6573 4.6978 0.2222 3.0680 2.3996 0.4836 0.3327 0.8930 1.9407 0.5100 0.9347 1.1677 14.8890 33.1768 38.5936 2.0120 5.6430 1.7301 10.0838 3.9947 4.1675 3.3106 13.1869 8.1136 28.1605 33.9434 8.5608 6.4811 7.7265 34.1232 4.1201 16.3884 6.8353 2.7318 12.2779 12.1214 8.0466 5.6865 3.2132 11.8433 5.7750 19.3329 12.5327 0.8834 4.0070 1.3289 4.7488 2.9712 7.8382 7.2236 4.0949 14.5292 14.1858 5.1589 9.5798 13.6005 6.2098 23.3208 8.4777 46.9812 118.4150 161.7508 40.1489 33.1993 33.4530 33.0469 12.9696 71.5814 69.8703 21.8885 17.4055 95.3792 18.0271 14.8385 8.4921 1.3222
temp: 298.150 k
press: 1.00000 atm
elementType: 8 7 6 6 6 6 6 6 6 6 6 6 6 1 1 1 1 1 1 1 1 1 1 1 1 1 1 1 1 1
symmnumber: 1
zpe: 680788.4 jmol-1
zpe.correction: 0.259299 hartree
zpe.thermalcorrener: 0.272066 hartree
zpe.thermalcorrenthalpy: 0.273010 hartree
zpe.thermalcorrgfe: 0.218826 hartree
zpe.sumelectzpe: -558.303959 hartree
zpe.sumelectthermal: -558.291192 hartree
zpe.sumelectthermalent: -558.290247 hartree
zpe.sumelectthermalfe: -558.344431 hartree
dipole: 0.0983 -0.6095 0.6009
dipole: 0.8616
quadrupole: -70.6769 -77.0169 -78.2731
quadrupole: 3.5335 2.0413 -0.4418
quadrupole: 4.6454 -1.6946 -2.9508 3.5335 2.0413 -0.4418
hfenergy: -558.5632572 hartree
pointgroup: C01 [X(C11H17N1O1)]
dipole: 0.061007 0.1516864 -0.2969388 debye
polarizability: 154.3308757|-10.9391192|108.6016137|-3.9967148|-7.1342151|112.5885476 unknown
InChI: InChI=1S/C11H17NO/c1-10-5-6-11(13-10)9-12-7-3-2-4-8-12/h5-6H,2-4,7-9H2,1H3
charge 0 multiplicity 1
30 atoms
O  1.797042 -0.229527 0.889511
N  -1.22253 0.347707 0.248081
C  -1.443902 -0.154064 -1.130386
C  -2.459497 0.928858 0.827436
C  -2.546987 -1.231099 -1.152871
C  -3.596434 -0.112554 0.861889
C  -3.860788 -0.682778 -0.550345
C  -0.086137 1.304815 0.332778
C  1.242844 0.708791 -0.015044
C  2.12916 0.895959 -1.064017
C  3.048752 -0.628746 0.367832
C  3.278578 0.045681 -0.821681
C  3.815296 -1.633426 1.165007
H  -0.492189 -0.571676 -1.50512
H  -1.733761 0.685524 -1.820521
H  -2.802026 1.823797 0.23895
H  -2.233011 1.277292 1.853342
H  -2.20319 -2.101407 -0.561481
H  -2.705714 -1.572747 -2.194063
H  -4.511474 0.355767 1.273678
H  -3.303041 -0.934517 1.542987
H  -4.257023 0.122053 -1.204385
H  -4.632255 -1.475119 -0.510452
H  -0.05788 1.687437 1.371839
H  -0.235187 2.190341 -0.338578
H  1.979108 1.562473 -1.91163
H  4.161071 -0.054614 -1.450584
H  3.243075 -2.571193 1.291546
H  4.762375 -1.873594 0.654359
H  4.054325 -1.253736 2.175923
