program: Gaussian 09
title: 000251685
version: EM64L-G09RevD.01
frameworkgroup: C1[X(C19H19NO5)]
method: RPBEPBE
basis: SDD
operation: Freq
keyword: #p
keyword: freq=noraman
keyword: PBEPBE/SDD
title: #p freq=noraman PBEPBE/SDD
converged: YES YES NO NO
title: Mulliken charges:
elementType: O O O O O N C C C C C C C C C C C C C C C C C C C H H H H H H H H H H H H H H H H H H H
charge: -0.300458 -0.257618 -0.412524 -0.248257 -0.269594 -0.500234 0.170335 0.383908 -0.014408 0.215374 -0.382217 -0.422547 -0.389350 -0.807607 0.320471 0.271501 0.169445 -0.526886 0.115449 -0.372906 -0.350666 -0.534783 -0.232807 -0.225596 -0.227909 0.316376 0.243655 0.250547 0.249370 0.230119 0.249736 0.312441 0.234652 0.234998 0.228739 0.233805 0.272827 0.245754 0.225828 0.226775 0.230060 0.232202 0.232162 0.379836
chargesum: 0.00000
title: Mulliken charges with hydrogens summed into heavy atoms:
elementType: O O O O O N C C C C C C C C C C C C C C C C C C C
charge: -0.300458 -0.257618 -0.032688 -0.248257 -0.269594 -0.187793 0.170335 0.383908 -0.014408 0.215374 -0.065841 -0.178893 -0.138803 -0.078382 0.320471 0.271501 0.169445 0.171503 0.115449 -0.139101 -0.077839 0.163575 -0.002746 0.006607 0.004254
polarizability: 4.59967189e+02 -5.89089808e+00 2.18221828e+02 -3.36731240e+00 -1.33982889e+01 1.54056724e+02
1716.lowfreq: -5.4900 -3.9367 0.0007 0.0010 0.0010 6.2219 16.7829 21.8419 28.8612
frequency: 16.7328 21.6639 28.8445 44.3331 56.2911 74.1077 76.1712 80.4478 113.6485 122.1656 133.5578 139.5056 151.2642 152.5207 166.9490 173.5847 204.8312 219.5468 227.0980 242.8750 277.9010 308.1722 317.0103 333.2413 340.1247 371.7089 397.6115 403.5292 409.9366 415.1819 470.3343 488.2735 491.4569 533.8713 538.4300 553.5489 572.6219 594.4274 614.2771 626.0870 642.7758 664.0950 680.4410 693.5242 705.6667 724.7385 740.5956 781.6939 790.4847 808.3234 826.6127 833.2159 857.9452 867.3156 937.0188 946.7619 962.1705 972.7329 984.2735 987.0860 989.8995 1001.2526 1004.2577 1023.2362 1045.3331 1048.6727 1074.2715 1080.3024 1091.7263 1112.6896 1113.9777 1149.3702 1151.1511 1173.4824 1185.9098 1188.2086 1203.8312 1208.1273 1251.9557 1259.3250 1277.3499 1293.0446 1316.5672 1365.5898 1384.2896 1392.5522 1398.8644 1407.1886 1432.9153 1436.9776 1444.5666 1457.5455 1460.0407 1464.5107 1467.4754 1469.4596 1475.0600 1480.0849 1482.3152 1487.0916 1567.4559 1574.9965 1589.0326 1603.9297 1609.8415 1613.8348 1631.8655 2963.3334 2968.2581 2983.6846 3053.6455 3059.8645 3066.1150 3097.5177 3109.3476 3116.1009 3122.2546 3128.1817 3131.9688 3144.8404 3157.3020 3158.2530 3168.8629 3175.0091 3534.3907 3541.5225
redmass: 4.5306 5.0773 5.8879 4.4782 6.8323 2.4457 3.9064 3.6488 4.1706 5.0510 1.6002 2.9145 3.0146 1.3801 4.7519 2.7982 7.7625 3.3038 2.0717 1.8041 4.3877 3.5983 6.4868 4.2451 5.0479 5.0908 4.5204 2.8505 4.5088 3.6283 5.6390 4.3074 5.8716 1.2685 2.6262 3.4912 5.0994 1.8202 6.3085 4.6077 4.8439 5.1430 6.5628 4.8964 1.5763 7.5546 5.7390 4.8547 2.6561 4.6838 1.4933 3.7966 1.2940 5.6193 1.4510 4.1775 1.7663 3.5453 1.5048 1.4198 4.4454 2.4020 1.3425 2.5500 1.6363 2.5856 2.1344 2.7464 2.1201 1.2482 1.2599 1.4087 1.3962 1.0589 2.8412 1.2605 1.6305 2.2646 2.9846 2.2852 3.0721 2.1155 1.3326 4.5448 9.0680 1.3170 2.0774 1.9003 2.1874 1.2352 1.3615 1.0695 1.4834 1.2311 1.1319 1.2156 1.2069 1.3993 1.3134 2.1571 7.3112 6.4145 6.8964 7.2544 6.1200 6.9644 7.0909 1.0314 1.0324 1.0403 1.1035 1.1042 1.0923 1.0853 1.1002 1.1016 1.0864 1.1003 1.0875 1.0922 1.0958 1.0884 1.1010 1.0964 1.0642 1.0771
irintensity: 1.8594 0.1311 0.5096 3.3603 1.3790 4.0216 1.6533 2.3228 1.6291 1.7080 5.3886 3.1860 2.9483 1.8846 1.3623 3.8010 2.9537 2.7486 0.8675 2.7011 7.9535 3.0224 3.8523 2.1753 2.8225 1.5254 16.7344 0.0436 7.4477 5.5102 22.7910 16.2989 23.1352 34.3222 57.8987 16.6599 10.6460 95.1102 0.0891 36.2316 0.7198 6.8637 13.5494 11.3585 114.1508 19.5533 5.9145 4.9832 12.2254 6.6803 34.2311 11.3409 0.4327 13.2275 1.3329 53.9485 17.3212 12.6182 1.8951 8.4499 0.1626 54.6221 1.8944 42.8731 88.7537 286.8256 62.2268 208.3661 27.3232 1.0339 0.3888 15.7735 4.3525 0.7787 70.1054 46.0572 16.1703 23.6271 376.6994 71.4682 70.3487 15.3839 4.6151 148.0976 1.7195 59.0360 498.8024 92.9327 2.0519 10.1557 16.6092 7.2803 170.2030 64.5703 13.9612 15.9154 12.5941 2.5383 34.3633 34.1058 1.1958 58.5596 251.8968 59.7693 26.5606 71.9653 156.3802 56.1480 83.3071 32.4526 40.9872 39.1713 16.1108 25.5822 8.9157 20.4646 9.5498 25.1896 2.6225 23.5685 18.0476 11.3302 27.2221 28.9625 59.2164 10.1656
temp: 298.150 k
press: 1.00000 atm
elementType: 8 8 8 8 8 7 6 6 6 6 6 6 6 6 6 6 6 6 6 6 6 6 6 6 6 1 1 1 1 1 1 1 1 1 1 1 1 1 1 1 1 1 1 1
symmnumber: 1
zpe: 894407.4 jmol-1
zpe.correction: 0.340662 hartree
zpe.thermalcorrener: 0.365237 hartree
zpe.thermalcorrenthalpy: 0.366181 hartree
zpe.thermalcorrgfe: 0.284010 hartree
zpe.sumelectzpe: -1164.464647 hartree
zpe.sumelectthermal: -1164.440072 hartree
zpe.sumelectthermalent: -1164.439128 hartree
zpe.sumelectthermalfe: -1164.521299 hartree
dipole: 2.0554 2.8699 -1.4689
dipole: 3.8234
quadrupole: -107.6164 -137.5507 -146.0647
quadrupole: -16.7388 8.2619 8.7055
quadrupole: 22.7942 -7.1401 -15.6541 -16.7388 8.2619 8.7055
hfenergy: -1164.8053091 hartree
pointgroup: C01 [X(C19H19N1O5)]
dipole: 0.7384164 1.0064255 -0.8394256 debye
polarizability: 459.5919575|2.4365034|209.3062185|-12.1770413|-25.9850468|163.3475649 unknown
InChI: InChI=1S/C19H19NO5/c1-12-16(24-2)10-9-14(17(12)25-3)11-15(19(22)23)20-18(21)13-7-5-4-6-8-13/h4-11,20,22H,1-3H3
charge 0 multiplicity 1
44 atoms
O  1.971262 2.424626 -0.586894
O  6.240971 0.230098 -0.169488
O  -1.489207 -2.887428 -0.051357
O  -2.760354 -1.162421 1.969097
O  0.483938 -2.806128 1.15529
N  -1.830529 -0.225419 0.049918
C  4.125205 1.30788 -0.364989
C  1.997942 0.070383 0.131684
C  2.719302 1.260588 -0.24999
C  4.850004 0.122814 -0.04042
C  2.779289 -1.073116 0.465699
C  4.18127 -1.05151 0.385208
C  0.540507 0.162121 0.144125
C  4.857711 2.541935 -0.848453
C  -0.507794 -0.730863 0.273815
C  -4.243854 0.017127 0.440156
C  -2.910043 -0.513291 0.889574
C  1.915739 3.436549 0.488889
C  -0.422402 -2.192129 0.535761
C  -4.557533 0.264488 -0.922734
C  -5.23104 0.244362 1.43316
C  7.049223 -0.962531 0.108019
C  -5.833125 0.753694 -1.281087
C  -6.502248 0.737252 1.07439
C  -6.805191 0.99872 -0.283576
H  2.270103 -1.970767 0.82241
H  4.741306 -1.948784 0.662669
H  0.205313 1.186706 -0.074312
H  4.16075 3.232638 -1.349394
H  5.352473 3.076027 -0.014504
H  5.657432 2.258748 -1.553478
H  -1.963591 0.447865 -0.706526
H  1.342264 4.280242 0.075054
H  2.929946 3.774285 0.77271
H  1.403337 3.029533 1.382454
H  -3.832235 0.031072 -1.71158
H  -4.979277 0.019174 2.4748
H  8.087197 -0.655388 -0.085918
H  6.944008 -1.280325 1.162788
H  6.772666 -1.798247 -0.562537
H  -6.072709 0.930935 -2.335327
H  -7.257122 0.915306 1.848048
H  -7.794149 1.378745 -0.563106
H  -1.431256 -3.83857 0.232751
