program: Gaussian 09
title: 000251646
version: EM64L-G09RevD.01
frameworkgroup: C1[X(C7H14N2OS)]
method: RPBEPBE
basis: SDD
operation: Freq
keyword: #p
keyword: freq=noraman
keyword: PBEPBE/SDD
title: #p freq=noraman PBEPBE/SDD
converged: YES YES NO NO
title: Mulliken charges:
elementType: S O N N C C C C C C C H H H H H H H H H H H H H H
charge: 0.159757 -0.322972 -0.128909 -0.651298 -0.406813 -0.380064 -0.352151 -0.343977 -0.635626 -0.669394 0.275796 0.259264 0.267470 0.268331 0.229958 0.234895 0.187388 0.227606 0.225680 0.229761 0.208257 0.227764 0.242105 0.342143 0.305028
chargesum: 0.00000
title: Mulliken charges with hydrogens summed into heavy atoms:
elementType: S O N N C C C C C C C
charge: 0.159757 -0.322972 -0.128909 -0.004127 -0.147549 -0.112593 0.146138 0.078306 0.047421 0.008731 0.275796
polarizability: 1.21907068e+02 -5.47882923e+00 1.19559245e+02 5.55188531e+00 5.34277370e+00 7.96557362e+01
1716.lowfreq: -18.0416 -6.0305 0.0010 0.0015 0.0019 13.9445 47.6430 58.9938 103.3190
frequency: 47.5127 58.8532 103.2688 103.7441 208.8459 209.7836 232.1415 274.5642 287.8501 301.6805 344.2518 353.5885 383.9648 412.1426 445.6397 470.9294 511.6926 550.7559 574.9042 609.6825 635.6734 708.4777 778.7954 870.6387 891.7226 915.1972 925.5475 997.0186 1013.7378 1031.1419 1061.1333 1089.0228 1097.5503 1118.9120 1131.5474 1185.0338 1225.4807 1229.6058 1266.8660 1282.2748 1292.4733 1312.6760 1340.7214 1358.7417 1390.7430 1392.2920 1435.7399 1442.6084 1459.7172 1464.9286 1470.5545 1477.5709 1479.2793 1577.2237 1632.8007 2963.8570 2977.7695 2983.8331 2986.0020 3025.3129 3029.8815 3043.4974 3068.0941 3071.2929 3078.4695 3090.6058 3099.9202 3560.0579 3710.4331
redmass: 5.4934 3.6244 3.3744 3.1495 1.1473 1.0392 2.5331 4.3114 3.0412 4.0423 1.8744 2.2098 2.2509 4.0020 1.8282 2.9938 1.1198 4.6045 3.7613 4.7248 3.2069 9.2505 3.0041 2.2519 2.0393 1.6296 1.8678 1.6008 1.5699 1.7686 1.6028 2.4840 1.9770 1.6837 2.0725 1.9860 1.7967 1.6068 1.3778 1.3432 1.4123 1.5911 1.2963 1.3516 1.2048 1.2199 2.1027 1.0888 1.0513 1.1287 1.1926 1.0465 1.0864 2.1132 1.9382 1.0642 1.0368 1.0599 1.0399 1.0855 1.0855 1.0967 1.0993 1.0981 1.0975 1.0996 1.1003 1.0447 1.1039
irintensity: 4.2624 14.2706 3.8462 2.7505 0.1505 0.0094 1.4939 3.5916 3.2526 3.5485 46.0549 52.2482 59.5067 14.5211 1.2624 4.7137 124.7112 8.9420 6.1736 2.6081 3.9006 27.8782 3.3930 0.7616 8.6012 11.1469 8.5647 18.7112 22.7489 11.4792 40.5216 5.8438 0.9802 1.1683 9.9540 6.0550 21.8884 11.3109 17.6967 14.8193 8.9038 92.9387 1.5111 12.2367 22.3911 16.9112 198.6409 18.8720 16.2606 35.4728 76.1292 7.0337 5.3673 288.9904 242.9799 35.7009 39.5243 50.3294 8.4801 10.4555 19.7151 31.0610 5.2451 34.3819 27.5280 25.3370 27.4259 29.8076 39.0323
temp: 298.150 k
press: 1.00000 atm
elementType: 16 8 7 7 6 6 6 6 6 6 6 1 1 1 1 1 1 1 1 1 1 1 1 1 1
symmnumber: 1
zpe: 551228.9 jmol-1
zpe.correction: 0.209952 hartree
zpe.thermalcorrener: 0.222361 hartree
zpe.thermalcorrenthalpy: 0.223305 hartree
zpe.thermalcorrgfe: 0.171465 hartree
zpe.sumelectzpe: -857.070645 hartree
zpe.sumelectthermal: -857.058236 hartree
zpe.sumelectthermalent: -857.057291 hartree
zpe.sumelectthermalfe: -857.109131 hartree
dipole: -1.3485 3.5004 0.4894
dipole: 3.7829
quadrupole: -88.8403 -64.1915 -74.0138
quadrupole: 5.7663 2.2977 3.2848
quadrupole: -13.1584 11.4904 1.6681 5.7663 2.2977 3.2848
hfenergy: -857.2805967 hartree
pointgroup: C01 [X(C7H14N2O1S1)]
dipole: 0.6156796 1.3405846 -0.1970775 debye
dipolederiv: -0.2235049 -0.0762407 0.0426881 -0.0833588 -0.3333591 -0.0475749 0.0613258 -0.0345654 -0.2339061 -1.0969989 -0.2263552 -0.0588826 -0.2970919 -0.7725372 0.0518815 -0.1119897 0.0570843 -0.4237704 -1.2977334 0.1851149 -0.1768891 0.1671971 -0.5352194 0.0549211 -0.2764366 0.079729 -0.4807585 -0.4802512 0.2999074 0.0137778 0.4459819 -1.0055995 0.1659895 -0.0709218 0.1759667 -0.7751501 0.3621846 0.2579199 0.0255481 0.2625892 0.2218266 0.0537693 -0.0188852 0.0415612 0.125612 -0.0337588 -0.1179243 -0.023871 -0.0969417 0.399246 -0.0703154 -0.00131 -0.0832905 0.1154782 -0.0232226 -0.1658189 0.0142314 -0.3860385 0.3357924 -0.0818887 0.0365006 -0.1242918 0.2843456 0.415074 0.097601 0.031382 0.2342435 0.129408 0.0816109 -0.0392295 0.1204381 0.2499764 -0.0689021 -0.0812538 -0.054454 -0.0472132 -0.0135889 -0.0596917 0.008089 -0.0117974 -0.0944662 -0.0283096 0.0291566 0.0091341 -0.0824447 -0.0515948 -0.0075899 0.0701371 0.0310357 0.064321 1.9361762 -0.1376503 0.4239435 -0.1661078 1.3649496 -0.3903003 0.5998147 -0.4135013 0.5386052 -0.0015492 0.0066386 -0.0408565 0.0281917 -0.0962495 0.0788074 -0.0210105 0.0711103 0.0000218 -0.0091462 0.0375813 -0.0920402 0.0145335 -0.0298255 -0.0019561 -0.0489973 0.018001 -0.1044162 0.0442889 -0.123605 0.0607258 -0.0087094 0.0594906 -0.0022552 0.0322549 -0.0176525 0.1206466 0.0490899 0.0644879 -0.1122803 0.0462767 0.0095875 -0.062457 -0.0667262 0.004171 -0.1476039 -0.0372095 -0.056854 -0.0840085 -0.0318513 0.0905907 0.0267004 -0.0766453 -0.0596115 -0.1120501 0.0072711 0.1354643 0.0061944 0.0753561 -0.1622186 0.0308026 -0.0070875 0.0708695 0.0790674 -0.0671887 -0.1544624 -0.0146581 -0.1142197 0.0218296 -0.0100773 -0.0180275 -0.0115722 0.0659301 0.0841712 0.0288832 -0.024009 0.0460232 -0.0643457 0.1262137 -0.0376046 0.0748352 0.0399602 -0.010189 0.1205868 0.0983283 0.0701858 0.0340788 -0.0759356 0.0652927 -0.068348 0.0087156 0.0525132 0.0758074 -0.0378566 0.0110952 -0.1646695 0.0675381 -0.0263459 0.0634246 0.0853753 0.0766042 -0.0290125 -0.0349972 0.0043113 0.0954831 0.0117427 -0.0955236 -0.0555532 -0.111196 -0.0606353 0.0039776 0.098622 0.0621785 0.0994313 -0.0492045 0.1030026 -0.0259621 0.0216894 0.2162798 -0.0466112 -0.0430272 -0.0592615 0.2159648 0.0496538 -0.0393961 0.0501275 0.3520321 0.1949464 -0.1273386 -0.0267452 -0.0949252 0.1515289 0.0596157 -0.0202801 0.0477919 0.3315407 unknown
polarizability: 122.5117203|5.3579605|118.8231664|5.4276677|-5.8805884|79.7871624 unknown
InChI: InChI=1S/C7H14N2OS/c1-5-3-9(7(8)10)4-6(2)11-5/h5-6H,3-4,8H2,1-2H3
charge 0 multiplicity 1
25 atoms
S  2.327483 -0.835873 0.152743
O  -2.845728 -0.442101 0.012555
N  -0.669363 0.246416 0.538719
N  -2.213788 1.713072 -0.550865
C  0.691848 -1.840942 0.205371
C  1.604491 0.857202 -0.354564
C  -0.350518 -1.093865 1.068797
C  0.432867 1.221812 0.585866
C  0.190137 -2.181817 -1.207036
C  2.743225 1.885984 -0.286037
C  -1.946623 0.459541 0.002601
H  0.994317 -2.759849 0.741286
H  1.234389 0.754984 -1.390572
H  -1.296087 -1.663422 1.090492
H  0.034041 -0.991994 2.102762
H  0.826405 1.26786 1.623002
H  0.071232 2.23773 0.341949
H  -0.723662 -2.80292 -1.148279
H  -0.069277 -1.268521 -1.770826
H  0.959406 -2.731846 -1.77477
H  2.387226 2.87984 -0.619093
H  3.128563 1.982848 0.74546
H  3.584046 1.590533 -0.93744
H  -3.157362 1.839841 -0.906846
H  -1.547464 2.474386 -0.633177
