program: Gaussian 09
title: 000251668
version: EM64L-G09RevD.01
frameworkgroup: C1[X(C15H16N2OS)]
method: RPBEPBE
basis: SDD
operation: Freq
keyword: #p
keyword: freq=noraman
keyword: PBEPBE/SDD
title: #p freq=noraman PBEPBE/SDD
converged: NO YES NO NO
title: Mulliken charges:
elementType: S O N N C C C C C C C C C C C C C C C H H H H H H H H H H H H H H H H
charge: 0.197684 -0.463751 -0.583706 -0.459553 -0.757930 -0.154893 0.555706 0.466229 -0.328766 -0.461227 -0.419869 -0.366635 -0.242582 -0.221975 -0.233875 -0.233515 -0.244296 -0.244818 -0.016909 0.331543 0.203098 0.261829 0.234666 0.239935 0.265959 0.409583 0.229097 0.226084 0.221499 0.218880 0.228934 0.222059 0.324933 0.340491 0.256092
chargesum: 0.00000
title: Mulliken charges with hydrogens summed into heavy atoms:
elementType: S O N N C C C C C C C C C C C C C C C
charge: 0.197684 -0.054169 0.081718 -0.203461 -0.426387 0.048205 0.555706 0.466229 -0.066936 -0.226561 -0.179934 -0.100676 -0.013485 0.004109 -0.012376 -0.014635 -0.015362 -0.022759 -0.016909
polarizability: 2.36861138e+02 -1.55936729e+01 1.90825974e+02 1.12886298e+01 2.33111705e+01 1.52143578e+02
1716.lowfreq: -13.4330 -7.1745 -0.0015 -0.0003 0.0012 5.8803 23.2258 32.0976 49.2871
frequency: 23.0180 31.9154 49.2038 66.1803 69.7341 77.8187 91.4917 169.7006 179.4037 207.1299 216.7083 241.3088 266.5401 333.0153 361.0042 391.1188 403.3153 406.7183 411.8892 467.7510 473.6775 475.2470 499.2209 554.1087 568.3959 595.1899 614.6292 614.9949 620.1752 634.8651 694.9668 703.5798 705.9340 713.4957 746.5394 776.0945 821.1290 843.5372 853.3444 855.2915 886.7122 914.5320 928.0982 965.4027 976.4401 977.7959 989.8266 990.0549 993.5953 996.2417 1025.2058 1028.5982 1031.8650 1049.0225 1073.0525 1082.7177 1089.6438 1168.6195 1172.4252 1179.5195 1187.9332 1192.7684 1198.8766 1220.9229 1250.9792 1281.9199 1303.9939 1317.8204 1332.9248 1345.3831 1380.7567 1388.6970 1437.7755 1438.6867 1479.3958 1482.2586 1542.4223 1588.9565 1593.4231 1600.3543 1610.8853 1611.9280 1628.6073 2662.0421 2898.4586 3028.9195 3113.2567 3118.4777 3121.7724 3127.3308 3136.0729 3139.3286 3150.3879 3153.6867 3164.8060 3171.6104 3410.3507 3526.8928 3672.7311
redmass: 5.2671 4.1149 4.6735 4.9899 4.2340 5.4335 6.5561 6.4648 6.5725 6.6192 4.9596 4.6889 4.9972 6.6926 4.0438 1.0834 2.8373 2.8947 4.8548 4.9710 1.9300 2.1170 3.5398 3.1324 4.1852 5.1612 4.9522 6.3009 3.3846 5.8395 4.1541 1.7861 1.7812 1.4680 1.9408 2.0225 2.8913 4.5358 1.2459 1.2544 1.2011 1.5671 1.4864 3.5761 1.3937 1.3895 4.6284 5.6342 1.4568 1.3223 2.4529 2.1521 3.2090 1.4060 1.8333 1.6330 1.9125 1.0646 1.0638 1.2544 1.6420 1.1195 1.5885 1.3046 1.9273 1.2261 1.4227 2.4227 1.2756 1.3820 7.5199 5.4760 2.1693 2.1270 2.2434 2.2588 1.1666 5.6069 5.9773 2.2431 5.9680 5.8928 1.7750 1.0838 1.0823 1.0846 1.0853 1.0864 1.0880 1.0869 1.0934 1.0918 1.0962 1.0986 1.1015 1.0959 1.0771 1.0450 1.1045
irintensity: 1.8085 0.2996 3.7665 5.1448 0.2751 1.2212 1.3256 2.6281 4.4634 11.8185 1.0624 0.5333 1.0348 2.4529 0.9293 22.2436 1.0363 0.3533 3.7939 13.0428 153.0982 99.5647 1.2759 27.2204 18.9147 39.8216 8.5779 0.3480 51.0390 20.7321 4.3392 62.3223 41.0796 88.8406 17.4029 61.0116 9.4541 9.3611 0.0520 0.3211 75.2862 0.6453 6.0120 7.6008 0.1153 0.2295 0.0463 0.8259 0.1558 0.2532 12.3211 7.5631 24.5698 10.7303 85.4668 4.5560 60.4394 0.6526 0.0504 3.9396 4.2914 1.1214 6.5451 3.3184 9.7248 54.5562 34.0316 161.8247 0.3987 22.9530 0.1300 4.2404 11.3291 14.0645 11.6934 17.4158 64.3782 14.7008 2.6627 104.1809 1.4032 3.9344 307.7826 1136.5865 32.6122 6.1188 4.7277 4.5704 4.1555 0.1543 39.0647 20.7200 36.1021 35.1579 18.2918 7.9066 9.0946 54.1207 28.0504
temp: 298.150 k
press: 1.00000 atm
elementType: 16 8 7 7 6 6 6 6 6 6 6 6 6 6 6 6 6 6 6 1 1 1 1 1 1 1 1 1 1 1 1 1 1 1 1
symmnumber: 1
zpe: 725909.2 jmol-1
zpe.correction: 0.276484 hartree
zpe.thermalcorrener: 0.294117 hartree
zpe.thermalcorrenthalpy: 0.295062 hartree
zpe.thermalcorrgfe: 0.229251 hartree
zpe.sumelectzpe: -1162.608161 hartree
zpe.sumelectthermal: -1162.590528 hartree
zpe.sumelectthermalent: -1162.589584 hartree
zpe.sumelectthermalfe: -1162.655395 hartree
dipole: 3.8127 3.4734 -2.7322
dipole: 5.8366
quadrupole: -81.0502 -120.7369 -119.2522
quadrupole: 0.4474 -5.2140 10.0949
quadrupole: 25.9629 -13.7238 -12.2391 0.4474 -5.2140 10.0949
hfenergy: -1162.8846455 hartree
pointgroup: C01 [X(C15H16N2O1S1)]
dipole: -2.0373985 -0.3221129 1.0090618 debye
polarizability: 189.2518467|19.6407475|234.485287|25.653377|-10.9752732|156.0935561 unknown
InChI: InChI=1S/C15H16N2OS/c16-15(17)19-14(12-9-5-2-6-10-12)13(18)11-7-3-1-4-8-11/h1-10,13-14,16,18H,17H2
charge 0 multiplicity 1
35 atoms
S  -1.282693 -1.258395 1.211047
O  0.352095 -2.166807 -1.454669
N  -2.98284 -3.313305 1.562292
N  -1.915678 -3.199643 -0.609584
C  -0.996654 -0.330081 -0.46455
C  0.348928 -0.752939 -1.161742
C  -1.195385 1.155678 -0.234466
C  1.621762 -0.370763 -0.406555
C  -0.522984 1.8602 0.798379
C  -2.067329 1.873483 -1.093811
C  2.258791 0.872691 -0.641686
C  2.194577 -1.272017 0.524061
C  -0.72143 3.247442 0.966327
C  -2.258814 3.264573 -0.93342
C  3.433305 1.225088 0.061649
C  3.366262 -0.921366 1.231077
C  -1.586832 3.956229 0.100311
C  3.987734 0.330354 1.006354
C  -2.148826 -2.7613 0.606158
H  -1.808256 -0.727609 -1.101449
H  0.331637 -0.175032 -2.116661
H  0.156449 1.324298 1.469934
H  -2.598407 1.33906 -1.891322
H  1.836699 1.567452 -1.37837
H  1.725529 -2.25128 0.654718
H  -0.563476 -2.608355 -1.236138
H  -0.197596 3.775931 1.770623
H  -2.934488 3.803546 -1.6071
H  3.917351 2.189223 -0.132584
H  3.802914 -1.627241 1.947423
H  -1.737956 5.033602 0.231733
H  4.901397 0.598825 1.54959
H  -3.374917 -4.244927 1.435555
H  -3.198263 -2.8051 2.41827
H  -2.472903 -4.005615 -0.937196
