program: Gaussian 09
title: 000251614
version: EM64L-G09RevD.01
frameworkgroup: C1[X(C4H8ClNO2)]
method: RPBEPBE
basis: SDD
operation: Freq
keyword: #p
keyword: freq=noraman
keyword: PBEPBE/SDD
title: #p freq=noraman PBEPBE/SDD
converged: YES YES NO NO
title: Mulliken charges:
elementType: Cl O O N C C C C H H H H H H H H
charge: -0.074479 -0.301366 -0.294452 -0.355022 -0.339036 -0.547337 0.306212 -0.493366 0.246861 0.261145 0.278177 0.267207 0.334157 0.239174 0.241197 0.230928
chargesum: 0.00000
title: Mulliken charges with hydrogens summed into heavy atoms:
elementType: Cl O O N C C C C
charge: -0.074479 -0.301366 -0.294452 -0.020865 0.168970 -0.001953 0.306212 0.217934
polarizability: 8.58547466e+01 -2.73753489e+00 6.64585531e+01 -4.69697448e+00 3.18520368e+00 4.48703262e+01
1716.lowfreq: -7.1744 -0.0008 0.0008 0.0026 7.0976 12.6713 31.1401 69.4648 84.8234
frequency: 30.9395 69.4422 84.7928 100.3836 155.1023 185.0354 264.9259 326.9700 424.2246 484.9732 593.6767 609.2659 641.9214 700.5369 817.8149 882.6437 984.6730 993.3412 1045.8761 1119.3815 1138.9601 1150.7223 1171.5514 1203.2198 1243.3196 1299.4282 1370.1573 1424.8875 1439.9683 1451.2197 1452.4982 1469.8695 1496.6029 1666.9289 2996.4924 3001.2354 3054.3979 3066.4110 3101.1586 3143.2635 3153.2397 3564.9691
redmass: 5.5397 5.9459 1.1625 3.1805 3.4384 5.3369 3.4682 2.8782 3.2567 3.1318 2.2943 1.5901 4.6691 11.9035 2.2464 3.3450 2.3793 2.6141 2.2309 1.2532 3.1258 1.4428 1.4836 1.7794 1.3487 1.1797 1.3181 1.1564 1.1035 1.0855 1.0509 1.0629 1.9019 8.8108 1.0600 1.0301 1.0904 1.0680 1.1047 1.1043 1.1118 1.0774
irintensity: 2.3460 5.8841 1.9989 11.5542 3.4248 3.9444 13.9275 19.4489 6.6669 5.5607 47.7429 111.9605 17.9609 26.0565 16.2921 12.7876 14.8414 37.5619 55.9681 0.7430 39.5852 45.0227 57.1542 112.2278 118.7437 48.2063 5.7581 3.0450 8.5448 27.7472 15.7292 43.1362 305.5289 282.9800 42.8452 36.0949 4.0168 20.8501 31.6318 18.0163 14.3253 45.4100
temp: 298.150 k
press: 1.00000 atm
elementType: 17 8 8 7 6 6 6 6 1 1 1 1 1 1 1 1
symmnumber: 1
zpe: 326439.5 jmol-1
zpe.correction: 0.124334 hartree
zpe.thermalcorrener: 0.133909 hartree
zpe.thermalcorrenthalpy: 0.134854 hartree
zpe.thermalcorrgfe: 0.087584 hartree
zpe.sumelectzpe: -821.846927 hartree
zpe.sumelectthermal: -821.837352 hartree
zpe.sumelectthermalent: -821.836408 hartree
zpe.sumelectthermalfe: -821.883677 hartree
dipole: -0.1720 0.0174 -0.1275
dipole: 0.2148
quadrupole: -52.9567 -56.7172 -53.4531
quadrupole: 10.5517 -0.3129 -0.4167
quadrupole: 1.4189 -2.3415 0.9225 10.5517 -0.3129 -0.4167
hfenergy: -821.9712613 hartree
pointgroup: C01 [X(C4H8Cl1N1O2)]
dipole: 0.0679655 -0.0157105 -0.0477129 debye
dipolederiv: -0.3442036 0.1316579 0.0175502 0.2170802 -0.4660218 0.0110076 -0.0153239 0.0691163 -0.2100518 -1.3810053 -0.312582 -0.1351622 -0.6917411 -0.7427277 -0.0405096 -0.0999949 0.0274336 -0.3525293 -0.7580001 0.1094312 -0.09265 0.1306772 -0.9551654 0.1658232 -0.1283619 0.1752906 -0.4210054 -1.4666206 0.0731338 -0.133814 0.0832619 -0.3780005 -0.0134979 -0.1649263 -0.0159935 -0.5591113 0.523116 0.1571269 0.0421567 0.5249747 0.034218 0.0997665 -0.0481406 0.0788518 0.2365827 0.2875838 -0.2558219 0.0463524 -0.336697 0.6151887 -0.1119403 0.0679356 -0.0768911 0.1626533 2.1898169 0.0273498 0.3724972 0.2204774 1.4093878 -0.2126412 0.4095817 -0.272574 0.4519938 0.7587479 0.0821193 0.0740835 -0.0293362 0.2254649 0.014897 0.1228629 0.0423727 0.3062877 -0.061544 -0.0497609 -0.0687743 -0.0869971 0.1110261 0.0032832 -0.0738382 -0.0521434 -0.1067416 0.1060829 0.10357 0.0064444 -0.0387028 0.0183124 0.026979 0.0614042 0.0217432 0.1123755 0.0629171 0.0504507 -0.080837 0.0667651 -0.0073782 0.0007645 -0.0381257 0.0022927 -0.0703317 -0.0947003 -0.044605 -0.0071169 -0.0469564 -0.0779799 0.030488 -0.0037937 0.0056682 0.1028468 0.2201571 0.0042251 -0.062081 -0.0726671 0.1758191 0.0267054 -0.0741582 0.0287057 0.3480799 -0.0473036 0.0194405 0.0193523 0.1290123 0.0196195 -0.0937867 0.0458379 -0.0954593 -0.0127257 -0.0012599 -0.0213227 0.0132473 0.0594562 0.0884823 0.0875744 -0.0582623 0.0444187 -0.1077981 0.0062159 -0.0744126 -0.0112485 -0.1286072 -0.0702455 0.005087 -0.0026966 0.0171677 0.1194752 unknown
polarizability: 84.7887265|-4.400493|66.938097|5.6271653|-4.5993926|45.4568022 unknown
InChI: InChI=1S/C4H8ClNO2/c1-8-4(7)6-3-2-5/h6H,2-3H2,1H3
charge 0 multiplicity 1
16 atoms
Cl -3.27381 1.271457 -0.106012
O  1.857541 0.839207 -0.145037
O  1.305419 -1.415955 0.278038
N  -0.271085 0.141093 -0.515654
C  -1.401665 -0.784274 -0.55799
C  -2.527047 -0.399527 0.403629
C  0.978747 -0.258383 -0.094935
C  3.243396 0.539874 0.269714
H  -1.802936 -0.859546 -1.586529
H  -1.015082 -1.780106 -0.269418
H  -2.170431 -0.256473 1.433612
H  -3.36365 -1.112798 0.363339
H  -0.41252 1.120095 -0.769626
H  3.70193 -0.192305 -0.416614
H  3.262531 0.134255 1.29539
H  3.765063 1.506186 0.218192
