program: Gaussian 09
title: 000251648
version: EM64L-G09RevD.01
frameworkgroup: C1[X(C20H32N2O2)]
method: RPBEPBE
basis: SDD
operation: Freq
keyword: #p
keyword: freq=noraman
keyword: PBEPBE/SDD
title: #p freq=noraman PBEPBE/SDD
converged: YES YES NO NO
title: Mulliken charges:
elementType: O O N N C C C C C C C C C C C C C C C C C C C C H H H H H H H H H H H H H H H H H H H H H H H H H H H H H H H H
charge: -0.440537 -0.285746 -0.236750 -0.099913 -0.349477 -0.345001 -0.366601 -0.355425 -0.405756 -0.402436 -0.396995 -0.398363 -0.390786 -0.398083 -0.502512 -0.479775 0.224299 0.342300 -0.147245 0.137796 -0.567412 0.180857 -0.854418 -0.532752 0.195124 0.251896 0.223483 0.191506 0.233518 0.176180 0.164022 0.208576 0.203317 0.219552 0.213800 0.201153 0.219951 0.191252 0.197367 0.190488 0.187988 0.199412 0.188984 0.210035 0.232600 0.238235 0.214154 0.237188 0.285275 0.222561 0.217144 0.281995 0.402874 0.219227 0.234615 0.217257
chargesum: 0.00000
title: Mulliken charges with hydrogens summed into heavy atoms:
elementType: O O N N C C C C C C C C C C C C C C C C C C C C
charge: -0.037663 -0.285746 -0.236750 -0.099913 0.097544 0.069989 0.043096 0.017173 0.017114 0.012517 0.014208 -0.010507 -0.003386 0.000936 -0.031677 -0.028434 0.224299 0.342300 -0.147245 0.137796 -0.282137 0.180857 -0.132718 0.138348
polarizability: 2.96041391e+02 5.94084220e+00 2.47501956e+02 1.44339493e+01 -1.23603034e+00 1.78058828e+02
1716.lowfreq: -17.6973 -6.5993 -0.0005 -0.0002 0.0003 1.0720 23.9121 29.5340 37.8344
frequency: 23.3229 29.2214 37.5095 46.4545 57.2829 60.2980 75.8765 107.9493 123.3563 133.3553 137.5460 164.1865 184.8287 205.7673 221.6740 230.8681 243.8590 251.9180 257.0128 289.4055 297.8718 303.5312 307.6520 325.2618 343.0486 388.1728 391.6070 410.8651 432.1473 441.1522 449.4759 452.9859 457.6467 469.5457 510.4684 534.5868 556.4595 568.8436 618.1815 642.6017 665.3459 702.5901 748.5101 767.4181 774.6273 804.6526 805.5317 835.5208 850.3565 852.0522 854.4930 858.2519 895.0541 899.9180 912.6520 947.7475 956.5139 957.7429 969.3679 980.6120 985.1036 993.9683 1002.7076 1038.6379 1044.3849 1048.6701 1060.0866 1069.6934 1080.6003 1084.6965 1101.5462 1110.8658 1112.4627 1113.6472 1119.1954 1123.0083 1148.2883 1148.7593 1154.1035 1159.5956 1178.4488 1187.8106 1190.6967 1204.1696 1220.8525 1253.4051 1255.5933 1263.4153 1263.9646 1276.8579 1277.4762 1291.8343 1296.0579 1308.1760 1321.9213 1324.3372 1332.8131 1334.5264 1337.6142 1342.3233 1346.7007 1352.6479 1355.5550 1358.9076 1364.6575 1377.7435 1388.6267 1392.8739 1410.7080 1439.8716 1450.5748 1452.6846 1456.2964 1458.3352 1459.0362 1461.2527 1461.9207 1464.8311 1466.1516 1466.4063 1469.2663 1472.1322 1472.3627 1478.8091 1479.9481 1483.3516 1491.9290 1532.4660 1605.4728 1630.0813 2410.5256 2817.5868 2830.2342 2892.8572 2901.1618 2901.9987 2946.8942 2951.0110 2965.4519 2970.3441 2971.0596 2979.4970 2981.4617 2985.1792 2987.6500 2990.7137 2997.8543 3018.2132 3030.8900 3031.5821 3034.4086 3038.4960 3039.3171 3040.3295 3040.9236 3049.1308 3050.3561 3051.6612 3058.6521 3112.4688 3114.4538 3148.6462
redmass: 3.7803 3.3789 4.0536 2.9259 3.0707 3.5579 3.3393 1.5460 2.6459 3.3315 2.3126 3.4531 2.7439 3.0870 2.8381 2.2451 1.8380 1.9984 1.6677 2.6967 2.7619 2.3308 2.0523 2.6994 2.3902 1.8253 5.6593 3.2012 3.2631 3.1581 2.9989 2.8447 3.1142 5.4933 3.1717 2.8373 2.3569 2.2760 3.4796 5.0752 4.5323 5.2782 3.8461 3.7216 3.5562 1.4841 1.4920 3.4049 2.5224 2.1914 1.7895 1.4391 2.4648 1.7674 1.6545 2.5793 1.4485 1.2993 2.8024 2.4528 2.3706 2.0054 2.4236 1.5264 2.2027 2.1410 2.2147 1.5267 1.4175 3.0380 2.9788 1.8161 1.2742 2.3854 1.4548 2.6510 1.3610 1.9856 2.1359 1.5431 1.2458 1.3299 1.3031 1.4989 3.5532 1.3505 1.3734 1.2337 1.2289 1.3504 1.3796 1.4470 1.4573 4.6108 1.4200 1.5152 1.4394 1.3719 1.4324 1.4073 1.5159 1.4663 2.1197 1.4506 1.5271 1.5996 1.8797 1.2096 2.6024 1.3158 1.0913 1.1493 1.2548 1.0889 1.0878 1.0754 1.2929 1.1380 1.0951 1.0912 1.1658 1.0976 1.1006 1.0833 1.0963 1.2491 1.0628 1.8013 7.4154 3.0380 1.0713 1.0713 1.0702 1.0695 1.0675 1.0692 1.0576 1.0329 1.0622 1.0405 1.0637 1.0615 1.0622 1.0890 1.0621 1.0614 1.1021 1.0873 1.0952 1.0910 1.1032 1.0900 1.0973 1.0953 1.1012 1.1000 1.1038 1.0944 1.1033 1.0991 1.0947 1.0899
irintensity: 0.5884 0.3581 0.4909 1.3586 0.1114 0.0783 2.4369 1.0911 9.8625 1.9881 0.5238 4.2702 0.1997 3.0633 0.5734 0.1848 1.4408 0.4610 1.0187 1.4812 0.9747 5.3316 2.5258 0.3693 9.5424 1.0479 1.3649 3.2346 14.4746 0.5567 0.3016 10.7306 19.0725 1.8784 3.9499 2.2458 2.5783 1.4014 21.1284 1.0496 8.1049 6.9913 15.2339 7.0692 23.0974 0.8584 0.2589 16.9308 25.2784 0.5427 4.4143 5.4577 9.4557 14.9796 8.1169 1.3511 10.8905 3.0805 5.5907 30.4198 40.4831 16.2479 32.0710 3.3264 13.1022 9.6620 48.6865 2.6874 8.3285 38.3083 45.8543 45.3060 0.5057 31.3032 18.8817 3.3515 9.6680 13.5479 24.8439 23.5725 25.0427 1.4051 0.5504 20.5104 108.7829 11.5176 4.9546 1.8859 4.5496 44.7248 1.5223 2.9600 16.8801 22.3288 8.7080 65.7782 12.3026 2.0141 1.5550 0.4198 3.2220 2.5559 38.4170 3.1855 16.4272 7.0166 37.0559 12.0563 56.8023 10.6571 6.7737 26.9038 41.9029 7.2999 11.7294 13.0835 41.0665 32.0061 7.1468 13.4642 81.2201 8.4384 2.8382 22.8852 5.6922 7.1821 11.0892 63.1099 10.5976 73.1700 1796.8632 57.9109 149.9200 31.0546 36.1094 64.0599 41.9944 77.8788 42.3996 47.2048 44.8818 34.2137 39.5905 10.5797 24.9078 24.6345 15.4793 65.2396 80.7421 45.9113 46.9835 30.2730 35.6747 54.6295 11.8891 32.3078 102.2300 2.5557 76.8375 37.2483 4.0719 6.0086
temp: 298.150 k
press: 1.00000 atm
elementType: 8 8 7 7 6 6 6 6 6 6 6 6 6 6 6 6 6 6 6 6 6 6 6 6 1 1 1 1 1 1 1 1 1 1 1 1 1 1 1 1 1 1 1 1 1 1 1 1 1 1 1 1 1 1 1 1
symmnumber: 1
zpe: 1284954.9 jmol-1
zpe.correction: 0.489413 hartree
zpe.thermalcorrener: 0.513510 hartree
zpe.thermalcorrenthalpy: 0.514454 hartree
zpe.thermalcorrgfe: 0.434945 hartree
zpe.sumelectzpe: -1039.385060 hartree
zpe.sumelectthermal: -1039.360964 hartree
zpe.sumelectthermalent: -1039.360019 hartree
zpe.sumelectthermalfe: -1039.439529 hartree
dipole: -2.6376 -0.0368 0.2030
dipole: 2.6456
quadrupole: -118.6093 -147.8319 -144.3945
quadrupole: 3.2548 2.7949 -0.5545
quadrupole: 18.3360 -10.8867 -7.4493 3.2548 2.7949 -0.5545
hfenergy: -1039.8744733 hartree
pointgroup: C01 [X(C20H32N2O2)]
dipole: 1.0367015 -0.0282028 -0.0886645 debye
polarizability: 295.9976489|-7.61561|247.3672168|13.2312387|5.1564208|178.2373101 unknown
InChI: InChI=1S/C20H32N2O2/c1-16-18(15-22-11-7-4-8-12-22)20(23)17(13-19(16)24-2)14-21-9-5-3-6-10-21/h13,23H,3-12,14-15H2,1-2H3
charge 0 multiplicity 1
56 atoms
O  1.100882 -1.471345 0.396104
O  -1.066647 3.696725 -0.1878
N  3.437114 -0.418003 0.39247
N  -3.097875 -1.087961 -0.266785
C  3.760593 -0.178305 -1.048825
C  4.63748 -0.870692 1.154856
C  -3.524143 -0.968445 1.151783
C  -3.889328 -2.117979 -0.984214
C  4.299043 -1.46262 -1.706481
C  5.214891 -2.167283 0.552286
C  5.540304 -1.989175 -0.949259
C  -5.016475 -0.594703 1.253767
C  -5.394329 -1.781973 -0.952297
C  -5.889849 -1.62706 0.504027
C  2.771488 0.775908 1.024655
C  -1.635824 -1.316011 -0.389075
C  1.346699 0.972472 0.513302
C  -0.808654 -0.066232 -0.114022
C  0.549446 -0.190754 0.26714
C  0.795242 2.271071 0.354733
C  -1.354994 1.225614 -0.269141
C  -0.568019 2.37575 -0.044256
C  1.606839 3.531175 0.613944
C  -2.456004 3.838248 -0.612632
H  4.516529 0.638805 -1.133561
H  2.837832 0.162882 -1.550086
H  4.333815 -1.036194 2.205278
H  5.417983 -0.071655 1.150494
H  -2.897472 -0.198906 1.637271
H  -3.348452 -1.932827 1.699797
H  -3.734599 -3.13635 -0.535349
H  -3.532585 -2.164671 -2.030745
H  4.545075 -1.253555 -2.764644
H  3.500557 -2.22996 -1.698963
H  4.474127 -2.981195 0.676845
H  6.121102 -2.456701 1.117562
H  5.882163 -2.947188 -1.383552
H  6.374965 -1.266581 -1.062827
H  -5.165997 0.40916 0.809202
H  -5.309576 -0.535863 2.319894
H  -5.960874 -2.576323 -1.475992
H  -5.557849 -0.833711 -1.500729
H  -5.81988 -2.607562 1.019673
H  -6.954738 -1.326266 0.522791
H  3.385324 1.688444 0.872776
H  2.746617 0.574959 2.115768
H  -1.434351 -1.65915 -1.424616
H  -1.276265 -2.135835 0.276718
H  -2.406388 1.280363 -0.568455
H  1.967599 3.579756 1.659032
H  2.495581 3.588231 -0.044345
H  0.989056 4.421642 0.426924
H  2.149414 -1.316312 0.441433
H  -2.625429 3.380126 -1.607271
H  -2.633874 4.923178 -0.668252
H  -3.153387 3.382834 0.118547
