program: Gaussian 09
title: 000251607
version: EM64L-G09RevD.01
frameworkgroup: C1[X(C16H15BrO)]
method: RPBEPBE
basis: SDD
operation: Freq
keyword: #p
keyword: freq=noraman
keyword: PBEPBE/SDD
title: #p freq=noraman PBEPBE/SDD
converged: YES YES NO NO
title: Mulliken charges:
elementType: Br O C C C C C C C C C C C C C C C C H H H H H H H H H H H H H H H
charge: 0.009968 -0.190865 0.062666 -0.513911 -0.426625 0.321620 -0.416150 -0.540148 0.205011 0.254246 -0.601145 0.199301 -0.399984 -0.346071 0.129191 -0.265571 -0.276775 -0.823520 0.226313 0.228262 0.206764 0.213881 0.234981 0.222332 0.208594 0.212932 0.275168 0.249498 0.252797 0.230946 0.235610 0.305084 0.315598
chargesum: 0.00000
title: Mulliken charges with hydrogens summed into heavy atoms:
elementType: Br O C C C C C C C C C C C C C C C C
charge: 0.009968 -0.190865 0.062666 -0.059336 -0.005980 0.321620 0.005376 -0.082835 0.205011 0.254246 -0.325977 0.199301 -0.150486 -0.093274 0.129191 -0.034625 -0.041165 -0.202838
polarizability: 2.76932810e+02 6.25806120e+00 2.26411333e+02 -9.20274777e+00 -6.47421916e-01 1.00342396e+02
1716.lowfreq: -7.9942 -0.0006 -0.0005 -0.0002 5.3947 9.3044 28.2279 57.6537 69.2773
frequency: 28.2187 57.6165 69.2559 84.5655 115.2267 133.8821 152.4651 176.8200 222.4389 232.5448 274.5715 304.3651 328.0441 370.4829 383.3347 421.4662 449.4977 469.9671 486.8271 501.8431 527.7818 569.7662 574.0483 619.7083 637.2672 656.5193 694.9540 718.0271 769.3627 777.8319 795.9103 829.6151 857.8094 873.8890 879.6371 894.9634 906.2148 928.4751 952.3364 971.5979 980.5773 986.3290 999.8898 1044.1519 1065.6139 1084.3289 1102.1936 1103.2974 1135.8279 1161.9515 1172.3487 1181.0455 1187.8883 1222.5581 1226.9157 1249.2031 1261.8898 1268.2821 1296.8686 1306.5807 1336.1216 1345.6042 1357.2444 1377.1387 1384.1645 1404.8331 1430.1012 1436.7229 1444.8445 1454.2396 1461.3990 1472.5789 1476.1711 1520.9185 1552.2778 1575.9325 1597.2483 1621.8356 2954.5495 2960.0363 2980.4750 2984.0717 3016.3616 3023.1585 3044.7532 3052.6969 3062.7882 3130.7458 3131.2655 3144.3236 3155.1799 3159.0593 3170.0054
redmass: 9.2549 8.5091 3.6765 3.1320 3.6843 8.5516 3.2600 4.7393 3.8440 4.0737 3.2150 1.8658 4.9115 3.7800 4.3646 3.2923 3.9413 4.3238 3.1156 4.0119 3.8520 5.0196 3.1389 5.1508 3.5490 3.3636 3.8317 4.5082 2.2360 2.1306 3.3617 1.5488 3.1248 1.6166 2.0543 1.6839 1.7813 2.6311 1.8465 1.4393 2.8299 2.9046 1.3285 2.4349 1.8047 1.9098 1.9090 1.8030 1.1566 1.6258 1.6091 1.7427 1.1295 1.4790 1.3010 1.2964 1.9206 1.3230 2.0942 1.7112 1.4779 1.4363 1.5948 4.0994 2.6026 5.9389 2.1020 1.2579 1.5926 1.0935 1.6343 1.0925 1.0958 3.3583 9.0347 6.7461 7.0731 6.0137 1.0645 1.0645 1.0653 1.0622 1.0927 1.0949 1.0983 1.1039 1.0562 1.0902 1.0860 1.0897 1.1074 1.0970 1.0994
irintensity: 0.9974 0.2086 1.7746 0.5042 1.8973 1.1035 1.0780 2.3070 2.7726 0.7794 11.3208 0.8072 1.4789 4.3683 0.6054 1.9880 2.5498 2.9941 1.9448 6.3196 2.3549 29.8311 11.8760 2.9443 5.1695 4.9809 2.0892 8.0332 37.4869 40.0085 6.2787 5.1996 2.8865 0.9563 2.8637 0.3028 2.2997 7.2257 11.8625 0.9130 7.8883 5.3106 0.4907 6.1371 55.6214 0.2112 4.4857 8.2446 1.7864 11.2423 7.1028 0.1807 1.4985 18.7898 28.0622 10.0921 39.0117 34.8793 29.7812 11.1141 4.9607 1.7505 0.1141 40.9355 0.8245 19.7846 5.0115 29.9230 5.5360 18.8881 2.0517 11.5908 10.6491 54.7107 239.5329 25.4889 8.6303 0.2868 19.1424 20.6628 37.0594 29.9257 33.8915 20.0538 71.9563 58.5661 5.4134 1.7329 4.2889 7.6883 4.4217 6.0890 30.9233
temp: 298.150 k
press: 1.00000 atm
elementType: 35 8 6 6 6 6 6 6 6 6 6 6 6 6 6 6 6 6 1 1 1 1 1 1 1 1 1 1 1 1 1 1 1
symmnumber: 1
zpe: 693569.3 jmol-1
zpe.correction: 0.264167 hartree
zpe.thermalcorrener: 0.279582 hartree
zpe.thermalcorrenthalpy: 0.280526 hartree
zpe.thermalcorrgfe: 0.219981 hartree
zpe.sumelectzpe: -706.122815 hartree
zpe.sumelectthermal: -706.107399 hartree
zpe.sumelectthermalent: -706.106455 hartree
zpe.sumelectthermalfe: -706.167000 hartree
dipole: -4.8725 2.4539 1.9317
dipole: 5.7875
quadrupole: -108.7964 -111.8823 -116.4191
quadrupole: 7.1148 3.4162 -4.5801
quadrupole: 3.5696 0.4836 -4.0531 7.1148 3.4162 -4.5801
hfenergy: -706.3869812 hartree
pointgroup: C01 [X(C16H15Br1O1)]
dipole: 1.8800731 -0.9779737 0.8327476 debye
polarizability: 277.2162828|5.1704175|225.5701687|9.6559112|-7.729151|100.9000865 unknown
InChI: InChI=1S/C16H15BrO/c17-10-16(18)15-9-11-5-1-2-6-12(11)13-7-3-4-8-14(13)15/h3-4,7-9H,1-2,5-6,10H2
charge 0 multiplicity 1
33 atoms
Br -5.0377 0.564078 -0.093987
O  -2.42385 2.710815 -0.60465
C  1.737735 -0.157917 0.099312
C  3.153051 -0.713436 0.235127
C  4.232231 0.367403 0.469618
C  1.517806 1.222674 -0.074174
C  4.019417 1.570432 -0.471465
C  2.660763 2.230207 -0.162681
C  0.604711 -1.062101 0.114803
C  -0.753239 -0.553466 0.017414
C  0.182521 1.712606 -0.149986
C  -0.945707 0.880823 -0.065763
C  0.797145 -2.48322 0.191251
C  -1.833977 -1.493038 -0.067143
C  -2.261033 1.602152 -0.015618
C  -0.280397 -3.37084 0.149531
C  -1.607594 -2.870113 0.005145
C  -3.363327 1.095909 0.925487
H  3.187846 -1.447493 1.063324
H  3.399675 -1.284091 -0.685407
H  4.186145 0.719474 1.51972
H  5.234126 -0.07751 0.322978
H  2.413741 2.990388 -0.928232
H  2.733543 2.778985 0.799811
H  4.041193 1.224936 -1.524413
H  4.833988 2.309116 -0.354037
H  0.013526 2.791327 -0.252936
H  1.812127 -2.884264 0.263391
H  -2.854096 -1.137393 -0.240252
H  -0.10652 -4.450906 0.205053
H  -2.4506 -3.565672 -0.067415
H  -3.08249 0.221155 1.526816
H  -3.695259 1.932881 1.558877
