program: Gaussian 09
title: 000251634
version: EM64L-G09RevD.01
frameworkgroup: C1[X(C22H28O3)]
method: RPBEPBE
basis: SDD
operation: Freq
keyword: #pfreq=noraman
keyword: PBEPBE/SDD
title: #p freq=noraman PBEPBE/SDD
converged: YES YES NO NO
title: Mulliken charges:
elementType: O O O C C C C C C C C C C C C C C C C C C C C C C H H H H H H H H H H H H H H H H H H H H H H H H H H H H
charge: -0.212246 -0.236515 -0.211148 0.380537 -0.114870 -0.119139 -0.116128 -0.233573 -0.535240 -0.558314 -0.517928 0.126403 -0.474398 -0.484210 -0.823540 -0.650435 0.587485 0.158324 -0.780245 -0.324066 -0.637856 0.166849 -0.800201 0.060314 -0.212228 0.215898 0.223152 0.229572 0.236285 0.207048 0.211519 0.212522 0.235245 0.225390 0.227601 0.264217 0.212326 0.234057 0.221449 0.219371 0.253825 0.228312 0.224870 0.240013 0.248111 0.229412 0.235484 0.283282 0.266173 0.244275 0.248590 0.255941 0.228431
chargesum: 0.00000
title: Mulliken charges with hydrogens summed into heavy atoms:
elementType: O O O C C C C C C C C C C C C C C C C C C C C C C
charge: -0.212246 -0.236515 -0.211148 0.380537 0.101028 0.104012 0.113444 0.002712 -0.116674 -0.110547 -0.064938 0.126403 0.002146 -0.028705 -0.122032 -0.185553 0.587485 0.158324 -0.067238 -0.040784 -0.371683 0.166849 -0.051395 0.060314 0.016203
polarizability: 3.16184353e+02 -7.43685007e+00 2.30754720e+02 2.59191213e+01 3.89526220e-01 1.79417949e+02
1716.lowfreq: -4.9666 -0.0004 0.0001 0.0004 8.1508 17.0195 29.8148 35.7976 50.1263
frequency: 29.7229 35.6401 50.1093 64.1283 72.5384 96.9100 117.3637 125.7033 145.7348 153.8842 161.6652 178.3469 190.9991 205.4616 216.1013 230.9685 242.6994 255.1742 265.9369 276.0165 282.5641 305.7783 315.3112 327.4874 349.2297 362.2967 383.7305 384.9635 415.2197 424.8115 453.4354 461.0749 491.2355 499.2803 530.1770 551.0256 566.6372 580.5186 611.9878 619.8213 641.0854 657.4581 684.0419 705.7779 728.0125 743.1528 798.6842 812.0050 829.0690 845.3199 848.1083 893.0969 903.5052 913.0750 915.3759 920.2042 933.9354 939.1094 948.0469 966.7472 971.6859 979.2040 998.7101 1003.9674 1013.0670 1016.6437 1031.8195 1033.3746 1047.3716 1065.5432 1073.0602 1084.5636 1090.7284 1109.7786 1117.1765 1125.0279 1128.8247 1136.7217 1156.6115 1169.2137 1184.2378 1185.7772 1206.1000 1216.2203 1225.2059 1234.6168 1243.1605 1244.1151 1256.3716 1267.3043 1276.5291 1283.6632 1291.6012 1301.6466 1317.2465 1324.3599 1329.2936 1332.3566 1334.5952 1335.3085 1346.2734 1352.3454 1356.6108 1364.7272 1370.3898 1389.2097 1400.8456 1404.4389 1444.0998 1452.6444 1459.8920 1464.7508 1466.8616 1467.8719 1473.8532 1478.6741 1481.5822 1485.6152 1490.8419 1491.6033 1547.1667 1582.6010 1618.3599 1622.5350 1661.0737 2913.2660 2940.7008 2957.7351 2966.6101 2967.1583 2972.0282 2973.1814 2977.6172 2978.6461 2989.4694 2993.1699 2994.3892 2996.7267 3014.4616 3022.1681 3041.7943 3050.1915 3051.4703 3052.5096 3061.4529 3074.1589 3079.4695 3092.7947 3094.8328 3097.1436 3104.9994 3118.2026 3132.6555
redmass: 6.8302 4.3407 5.3286 5.0355 4.8430 2.8870 3.0389 1.1289 2.4776 2.5782 4.8185 4.2666 2.0757 2.1304 2.4789 1.2431 4.0707 1.8744 2.6937 2.3774 2.8436 3.1018 5.3048 3.7043 3.2246 2.4103 2.9330 3.6907 3.7289 3.7191 3.1571 2.7946 2.5842 4.5996 2.6799 3.0064 3.8258 3.6411 4.3308 3.6381 2.9792 4.0694 3.8990 2.2755 3.3451 3.0665 2.6170 2.3028 1.7310 2.6596 1.9608 1.9847 1.4813 1.9002 2.6308 2.4346 1.7741 1.7231 2.0206 1.7452 1.8135 2.0649 2.3429 1.8691 2.8227 1.8050 1.9365 1.8043 2.5419 2.6920 2.8324 2.6216 2.0831 1.7133 2.3438 2.0647 2.4744 1.8192 2.2493 1.7819 1.9823 1.6846 1.5862 1.2079 1.8383 1.4047 1.5611 1.6348 1.7532 1.5002 1.3318 1.3882 1.3810 1.3170 1.3665 1.4291 1.3824 1.5719 1.3332 1.4990 1.4800 1.6584 1.7699 1.4902 1.2468 1.3084 1.9497 1.2005 1.0734 1.0614 1.0699 1.0822 1.0917 1.0818 1.0791 1.0729 1.0618 1.0609 1.0700 1.0740 9.6847 9.1954 7.4636 7.3707 7.7820 1.0811 1.0816 1.0613 1.0719 1.0878 1.0684 1.0720 1.0602 1.0560 1.0434 1.0525 1.0551 1.0460 1.0633 1.0963 1.0980 1.0994 1.1015 1.1004 1.0943 1.0981 1.1036 1.1002 1.0983 1.0994 1.0888 1.1006 1.0919
irintensity: 2.0298 2.7950 1.5748 0.6523 3.0369 0.4633 2.6909 0.4895 3.4765 11.0219 7.4331 1.9527 0.3651 0.2000 0.3795 0.5574 1.1220 4.0530 0.2657 1.6278 2.0246 1.7946 6.0414 0.7478 0.6106 0.1469 1.7527 0.8748 1.9808 0.4932 0.5529 1.8311 1.8008 18.3550 4.7006 0.6067 5.0596 9.3960 9.9509 4.0560 3.4988 8.6990 8.6585 5.9434 3.8595 0.6748 13.9351 0.5804 1.8048 18.5188 1.9525 3.4351 13.4061 10.1792 33.4783 8.1291 7.7629 8.9975 10.7478 3.7464 4.6943 1.0290 4.4731 3.0004 1.8605 8.4416 1.6788 0.6316 0.3339 0.7977 7.5495 4.0488 2.3175 8.3874 0.2678 1.9854 2.6393 13.7374 19.2968 25.7116 12.9918 14.0974 46.1387 15.1906 4.7326 17.1531 20.4620 57.3856 42.7375 5.8693 0.7247 5.8795 8.4068 0.5648 11.5457 2.5149 4.6675 13.7767 0.8594 32.5025 2.4191 10.8526 4.4873 19.0599 65.4093 15.7698 4.4907 28.8658 16.7210 9.0103 6.7215 22.8029 8.4608 7.4947 12.1222 3.8663 4.0979 6.0083 6.2022 9.1773 119.1188 202.2448 88.6914 108.2447 201.7098 10.9479 5.6316 32.8851 15.9626 45.0803 19.3021 5.9314 22.6343 38.4169 8.0377 17.8702 21.0009 41.6243 34.3109 43.1932 37.6730 19.5612 47.6711 30.1214 9.5218 33.4481 37.3960 23.2485 14.0132 21.2887 4.6157 15.8102 8.1439
temp: 298.150 k
press: 1.00000 atm
elementType: 8 8 8 6 6 6 6 6 6 6 6 6 6 6 6 6 6 6 6 6 6 6 6 6 6 1 1 1 1 1 1 1 1 1 1 1 1 1 1 1 1 1 1 1 1 1 1 1 1 1 1 1 1
symmnumber: 1
zpe: 1177030.8 jmol-1
zpe.correction: 0.448307 hartree
zpe.thermalcorrener: 0.472100 hartree
zpe.thermalcorrenthalpy: 0.473044 hartree
zpe.thermalcorrgfe: 0.396113 hartree
zpe.sumelectzpe: -1078.912290 hartree
zpe.sumelectthermal: -1078.888497 hartree
zpe.sumelectthermalent: -1078.887553 hartree
zpe.sumelectthermalfe: -1078.964484 hartree
dipole: 3.7662 -2.5956 0.4359
dipole: 4.5947
quadrupole: -209.0556 -152.9645 -147.0694
quadrupole: 14.6078 -19.3802 -3.0755
quadrupole: -39.3591 16.7320 22.6271 14.6078 -19.3802 -3.0755
hfenergy: -1079.360597 hartree
pointgroup: C01 [X(C22H28O3)]
dipole: 1.4821267 1.0290742 -0.1100783 debye
polarizability: 317.3459349|8.2445351|230.7529559|-22.274159|1.739759|178.2581311 unknown
InChI: InChI=1S/C22H28O3/c1-13(24)17-6-7-18-16-5-4-15-10-20(25)14(12-23)11-22(15,3)19(16)8-9-21(17,18)2/h10-12,16-19H,4-9H2,1-3H3
charge 0 multiplicity 1
53 atoms
O  6.032493 -0.593064 -0.372163
O  -5.531546 0.276051 1.173108
O  -4.238479 -3.428377 -0.189862
C  2.686307 -0.295906 -0.081832
C  1.900831 0.934724 0.482606
C  0.575556 1.209634 -0.261904
C  -0.325532 -0.064811 -0.142264
C  3.955769 -0.240473 0.867783
C  1.7866 -1.544773 0.074245
C  2.967937 2.0506 0.572789
C  0.413515 -1.345532 -0.624714
C  -1.75321 0.146923 -0.835625
C  4.270737 1.288026 0.990203
C  -0.142055 2.458769 0.299382
C  3.123156 -0.113691 -1.559937
C  -1.523134 2.680459 -0.374482
C  -2.36496 1.428176 -0.261896
C  5.140853 -1.077248 0.378419
C  -1.618857 0.281385 -2.395389
C  -2.623753 -1.059969 -0.587979
C  -3.577796 1.439224 0.375521
C  -3.838042 -1.041515 0.047331
C  5.206338 -2.527715 0.842454
C  -4.403705 0.23535 0.576704
C  -4.628582 -2.298363 0.214957
H  1.623938 0.666393 1.529241
H  0.801529 1.399751 -1.331997
H  -0.541289 -0.195248 0.942054
H  3.632982 -0.646731 1.848689
H  1.618203 -1.742923 1.15385
H  2.271049 -2.445483 -0.351622
H  2.697069 2.833162 1.303128
H  3.096338 2.548133 -0.407292
H  0.565853 -1.304738 -1.71988
H  -0.20554 -2.238898 -0.424255
H  5.121636 1.540079 0.334173
H  4.569327 1.53477 2.024566
H  0.487919 3.355342 0.149505
H  -0.285576 2.34009 1.393141
H  2.266656 0.095908 -2.223039
H  3.852568 0.705211 -1.676468
H  3.612388 -1.032142 -1.932575
H  -1.358724 2.941222 -1.440051
H  -2.046178 3.535272 0.090252
H  -2.595678 0.541365 -2.838779
H  -0.893967 1.06523 -2.671795
H  -1.284651 -0.669335 -2.845144
H  -2.278275 -2.027549 -0.979708
H  -3.987899 2.371147 0.78373
H  5.503271 -2.555681 1.909831
H  4.219774 -3.021019 0.774159
H  5.952377 -3.086243 0.255554
H  -5.604537 -2.166964 0.732078
