program: Gaussian 09
title: 000251601
version: EM64L-G09RevD.01
frameworkgroup: C1[X(C13H9NO2)]
method: RPBEPBE
basis: SDD
operation: Freq
keyword: #p
keyword: freq=noraman
keyword: PBEPBE/SDD
title: #p freq=noraman PBEPBE/SDD
converged: YES YES NO NO
title: Mulliken charges:
elementType: O O N C C C C C C C C C C C C C H H H H H H H H H
charge: -0.190734 -0.186802 -0.002439 0.339467 0.069792 0.071792 0.000487 -0.326782 -0.352734 -0.235740 -0.225016 -0.267176 -0.223775 -0.186652 -0.155515 -0.366043 0.248729 0.274170 0.232817 0.234629 0.277343 0.234046 0.248053 0.237598 0.250486
chargesum: 0.00000
title: Mulliken charges with hydrogens summed into heavy atoms:
elementType: O O N C C C C C C C C C C C C C
charge: -0.190734 -0.186802 -0.002439 0.339467 0.069792 0.071792 0.000487 -0.078053 -0.078564 -0.002923 0.009613 0.010167 0.010270 0.061401 0.082083 -0.115557
polarizability: 2.12647400e+02 -6.99365811e+00 1.27382779e+02 -3.33088543e+00 -8.86735148e+00 1.11532755e+02
1716.lowfreq: -0.0007 -0.0006 0.0003 3.6693 5.2236 10.0842 20.8664 34.5797 48.6569
frequency: 20.6516 34.5589 48.6387 114.2349 132.9102 149.6088 153.0260 253.8385 258.3956 311.6003 394.6096 396.9910 414.3981 420.6266 458.0744 481.3233 606.5841 612.5671 642.0906 688.1808 694.5525 713.8708 717.1197 748.9590 792.9155 810.4652 858.1029 869.3146 915.1695 946.6342 964.2761 972.5082 988.4546 991.2929 1008.5407 1012.0873 1017.9725 1030.0092 1049.6485 1085.4119 1086.6105 1161.4984 1174.5448 1187.3674 1226.6147 1281.3313 1297.9795 1319.8253 1330.5553 1390.8992 1415.5452 1436.8645 1445.6023 1480.0435 1551.6246 1561.5986 1565.2346 1583.8627 1591.6303 1611.0882 3130.2908 3137.2032 3140.7668 3148.3618 3150.2461 3160.3084 3164.9129 3170.3845 3176.8675
redmass: 6.6949 3.9444 4.7596 7.2756 8.9900 5.2359 5.5847 7.5930 5.7324 9.5590 3.5447 2.8656 4.7154 5.2134 4.8326 5.3537 7.6596 6.4513 7.3273 3.3451 2.5498 2.8878 5.5863 1.6386 2.4769 2.8732 1.2564 5.2318 1.3227 1.4498 6.7741 1.4681 3.5618 1.6676 1.3488 1.3600 3.2929 2.3968 2.6580 1.6068 1.5873 1.0818 1.0655 1.1318 3.7488 1.6042 4.9659 1.3898 5.4679 9.2296 2.0055 2.2889 2.2372 2.2830 8.8347 6.7002 6.4686 9.0562 6.5558 6.0711 1.0853 1.0880 1.0880 1.0903 1.0924 1.0966 1.0947 1.1015 1.1015
irintensity: 4.0110 0.4197 2.6599 0.2635 1.5882 1.6951 0.0843 34.1695 3.2852 2.8746 4.1129 0.0968 1.2629 0.4720 9.4275 9.8110 25.1251 0.1856 89.5945 9.3798 47.8648 50.8635 5.3039 49.5924 28.2271 36.1976 0.9884 75.2345 0.8658 2.0035 8.1243 1.4174 1.6839 0.5846 0.1045 0.4734 1.2168 5.0803 6.8005 10.5037 8.5915 4.5575 3.3219 30.4394 199.8805 0.1869 25.0249 6.4777 6.1928 5.1233 11.5727 25.8672 3.5589 1.4003 156.5449 88.1040 31.7085 66.9223 24.6249 10.6615 0.2295 5.8109 5.3989 10.7031 12.6197 19.4134 9.7940 23.0922 20.9932
temp: 298.150 k
press: 1.00000 atm
elementType: 8 8 7 6 6 6 6 6 6 6 6 6 6 6 6 6 1 1 1 1 1 1 1 1 1
symmnumber: 1
zpe: 483649.5 jmol-1
zpe.correction: 0.184212 hartree
zpe.thermalcorrener: 0.197294 hartree
zpe.thermalcorrenthalpy: 0.198238 hartree
zpe.thermalcorrgfe: 0.142227 hartree
zpe.sumelectzpe: -704.864352 hartree
zpe.sumelectthermal: -704.851270 hartree
zpe.sumelectthermalent: -704.850326 hartree
zpe.sumelectthermalfe: -704.906337 hartree
dipole: -1.6659 -1.4851 -3.6942
dipole: 4.3160
quadrupole: -58.0174 -93.6225 -95.0324
quadrupole: -1.2489 1.1473 -1.5805
quadrupole: 24.2067 -11.3984 -12.8083 -1.2489 1.1473 -1.5805
hfenergy: -705.048564 hartree
pointgroup: C01 [X(C13H9N1O2)]
dipole: 0.6694202 -1.5389463 0.2586933 debye
dipolederiv: -0.9163397 -0.1118871 -0.0277837 -0.296812 -0.5784911 0.208203 0.2425721 0.3582749 -0.5612418 -0.7898734 0.0969842 -0.01536 0.1934935 -0.4780337 -0.2425348 0.1200319 -0.2942774 -0.6457273 -0.3129544 0.0315955 0.0195698 -0.025278 -0.2146005 -0.0813622 -0.1268421 -0.0104111 -0.2068905 -0.7910989 -0.3096895 0.1028262 -0.3061786 -0.1604019 0.0956451 0.0430101 0.0794675 -0.055375 1.5973304 0.3956802 -0.0740489 0.6744246 0.5958448 -0.2455473 -0.4011406 -0.4277951 0.4247251 -0.3496151 0.1309742 0.0454538 0.1538467 -0.0111705 -0.0539776 0.2086428 -0.0773365 -0.020482 1.4202024 -0.3411508 -0.0811222 -0.549824 0.4311389 0.3130501 -0.1024143 0.3862702 0.5871916 0.0915499 0.0251517 0.0899058 0.1869965 -0.0212388 -0.001558 -0.1151943 -0.0951876 -0.012756 0.0771563 0.1353654 -0.1116367 -0.0089135 -0.0344932 -0.0981368 0.1640626 -0.0100219 0.0002247 -0.2628653 0.008064 -0.0659946 0.0053472 -0.0727173 -0.1442655 -0.1133009 -0.1512918 0.0628288 -0.0148752 -0.039648 0.1999989 -0.0782412 -0.1899889 0.0317064 0.2239385 0.0322008 -0.0497035 -0.2023484 0.0080859 -0.0270416 0.0841734 -0.0275354 0.0605405 0.0598994 0.0410272 -0.0076543 0.0875277 0.0987212 0.01572 0.1025079 -0.0356059 -0.0772886 -0.0042866 -0.0824234 0.0217925 0.2035668 -0.0002577 0.1110735 0.0028024 -0.0772211 0.0527586 0.0906699 0.0565224 -0.0266946 0.0395709 -0.1502282 -0.1293211 -0.0140126 -0.0719064 0.0046236 0.0253195 -0.0298372 -0.119715 -0.1493804 0.1246327 0.1344701 -0.0569539 0.1080198 0.206306 -0.0920515 0.2463263 0.2136594 0.0295021 -0.0058002 -0.0976797 0.0086189 0.1178033 0.0026828 -0.1068468 0.0241513 0.0483644 0.1393495 -0.0315125 0.0299633 0.0043379 0.1048599 0.0772008 -0.0038602 0.0600732 0.0325406 0.0818112 -0.0348061 0.0043427 -0.0501399 0.0765008 0.1105931 0.0296132 0.1188159 -0.0410586 -0.0405254 -0.0196508 -0.1049255 -0.0241461 0.1313361 0.0309612 -0.1236181 0.0289855 0.0141472 0.1454038 0.0113744 0.0055325 -0.0089428 0.0877612 -0.081142 -0.0217026 -0.0800402 0.0572084 -0.0659167 -0.1048438 0.0215134 -0.1102652 0.0860126 0.0395858 0.0224064 0.0392832 0.1018811 -0.0684908 -0.0060002 -0.0743408 -0.009785 0.1235377 -0.0339304 -0.0813547 -0.0334066 0.0839792 -0.0306322 0.0903228 0.0484749 0.0917176 0.0800661 -0.0626333 0.0419509 -0.0586024 0.1035432 0.0819448 -0.0014772 -0.0195903 0.0312261 0.0305234 -0.1114805 0.0204952 -0.1207671 -0.0047877 unknown
polarizability: 212.7159618|7.1540661|108.0798081|2.3878135|3.0802047|130.767164 unknown
InChI: InChI=1S/C13H9NO2/c15-12(10-6-2-1-3-7-10)13(16)11-8-4-5-9-14-11/h1-9H
charge 0 multiplicity 1
25 atoms
O  -0.354622 1.652149 -1.372924
O  0.561922 1.479117 1.749376
N  1.738005 -0.707881 -0.850257
C  -1.801691 0.20428 -0.062692
C  -0.531476 0.916388 -0.358042
C  1.882369 0.153423 0.206594
C  0.638438 0.862875 0.648515
C  -1.974904 -0.546909 1.131086
C  -2.856419 0.268336 -1.014635
C  -3.188241 -1.226516 1.366865
C  -4.065069 -0.41225 -0.776567
C  3.108938 0.357639 0.886493
C  -4.233107 -1.161013 0.415232
C  4.246309 -0.34986 0.443764
C  4.112613 -1.239436 -0.648398
C  2.841631 -1.39133 -1.256556
H  -1.173064 -0.586499 1.875903
H  -2.699121 0.853129 -1.927247
H  -3.323599 -1.80166 2.289015
H  -4.8762 -0.364139 -1.51109
H  3.1409 1.054438 1.729471
H  -5.174718 -1.690241 0.600334
H  5.215016 -0.212433 0.934974
H  4.970005 -1.806341 -1.0247
H  2.70008 -2.077467 -2.098813
