program: Gaussian 09
title: 000251563
version: EM64L-G09RevD.01
frameworkgroup: C1[X(C22H26N2O4)]
method: RPBEPBE
basis: SDD
operation: Freq
keyword: #p
keyword: freq=noraman
keyword: PBEPBE/SDD
title: #p freq=noraman PBEPBE/SDD
converged: YES YES NO NO
title: Mulliken charges:
elementType: O O O O N N C C C C C C C C C C C C C C C C C C C C C C H H H H H H H H H H H H H H H H H H H H H H H H H H
charge: -0.208935 -0.300014 -0.267713 -0.270141 -0.110172 -0.498185 -0.130239 -0.197371 -0.058708 -0.513591 -0.440918 -0.087734 0.152490 -0.380342 0.121897 -0.511588 0.218155 0.168897 -0.718650 -0.267817 0.236217 0.078720 -0.418685 -0.551406 -0.379938 0.338606 -0.504317 -0.536627 0.240390 0.250462 0.215748 0.228648 0.231853 0.204811 0.212765 0.224677 0.211388 0.194850 0.224997 0.205796 0.299885 0.240924 0.239580 0.220232 0.285335 0.234267 0.242660 0.242717 0.245679 0.224586 0.241312 0.215986 0.215364 0.243196
chargesum: 0.00000
title: Mulliken charges with hydrogens summed into heavy atoms:
elementType: O O O O N N C C C C C C C C C C C C C C C C C C C C C C
charge: -0.208935 -0.300014 -0.267713 -0.270141 -0.110172 -0.198299 0.110152 0.053091 0.157040 -0.053090 -0.023342 0.136944 0.152490 0.025896 0.121897 -0.080794 0.218155 0.168897 -0.017913 0.017518 0.236217 0.078720 -0.184418 -0.308746 -0.137220 0.338606 0.207259 0.137918
polarizability: 3.67753764e+02 -3.34915777e+01 2.76535712e+02 -6.36012018e+00 4.61729462e+00 1.69115210e+02
1716.lowfreq: -4.5647 -0.0010 -0.0005 0.0002 4.5203 10.8793 21.9002 32.0668 45.3274
frequency: 21.7142 31.9536 45.3045 54.7637 61.7674 83.6788 96.3324 110.2482 114.8831 133.3011 143.7674 151.7306 171.6380 181.1116 206.2799 209.9698 223.7706 238.0829 242.5391 271.4334 291.6000 295.2533 302.0694 310.7559 324.1049 337.9862 376.1834 385.7079 395.9202 430.2013 436.3857 457.6490 466.7856 479.9031 488.4688 497.7140 505.3906 507.9082 518.1432 560.3891 596.1861 618.7952 621.3318 637.5497 665.1242 691.7431 710.8432 731.9245 742.3292 747.2917 755.0601 761.6335 802.3730 810.6100 812.4911 819.9831 845.1594 884.4790 895.0174 922.2994 924.1758 935.0346 944.1734 944.8216 967.6178 985.9064 991.7787 997.9103 1019.7937 1031.8097 1044.4298 1055.6560 1073.6487 1094.5971 1107.4426 1112.8701 1113.7337 1123.1674 1129.3231 1137.8544 1141.1730 1147.0908 1153.2659 1164.7167 1169.9011 1180.9983 1201.2757 1209.2302 1217.0564 1228.4155 1237.9536 1244.0511 1250.5324 1260.0799 1273.5259 1279.3977 1299.1119 1305.6722 1309.2148 1312.0403 1329.2033 1332.6152 1343.8252 1350.1394 1354.1744 1367.0677 1372.9172 1389.1079 1395.6265 1396.5746 1421.8748 1434.4535 1440.8051 1448.5757 1456.1786 1458.2046 1462.9106 1463.5011 1464.4703 1467.8284 1473.5229 1477.2648 1480.0961 1482.1161 1493.5282 1578.4237 1579.9406 1606.3691 1619.4112 1638.6536 2776.8708 2855.3517 2866.4793 2947.6664 2960.9426 2971.1863 2993.3262 3001.1988 3003.9730 3013.2338 3018.7638 3019.8641 3030.0278 3030.6308 3036.9176 3088.1795 3090.5456 3102.1711 3102.5835 3117.8796 3134.2640 3139.9044 3152.2618 3168.4289 3169.4504 3607.2672
redmass: 4.8022 4.9597 4.5579 5.0973 5.3459 3.3446 4.9503 1.1256 3.1967 3.4877 3.5661 3.5409 3.6586 4.1876 2.2436 1.3786 2.3506 2.5814 1.6103 2.9285 3.6468 3.9829 3.5530 3.8644 3.8760 2.8296 4.0207 4.3556 4.8764 2.8113 4.2924 3.8024 4.6173 4.1939 1.1959 3.8921 4.8336 2.7892 3.8004 3.7526 5.2578 4.5084 3.5402 4.6881 4.5437 3.9147 6.8572 4.6483 3.1356 3.6611 3.3810 4.0279 3.4012 1.7148 3.6604 1.7796 2.5647 2.2452 4.1521 3.5448 1.4181 3.8915 1.8891 1.4692 2.1807 2.3608 2.2832 3.2123 2.6671 3.8731 1.9146 2.5252 2.4149 2.2301 2.0647 1.2649 1.2613 2.3844 2.5419 2.1590 1.4959 1.5552 1.7153 1.9156 2.2154 1.8677 1.4127 1.3647 1.6902 1.5722 1.8540 1.7396 2.2214 1.5009 1.7206 1.6625 1.5545 1.4508 1.4189 1.3210 1.4950 1.3813 1.5853 1.5070 1.6775 1.9074 1.8649 1.2298 3.4578 1.5866 1.2027 1.2289 3.7580 1.0515 1.1358 1.1169 1.0953 1.0508 1.0503 1.0546 1.3098 1.1098 1.0553 2.6837 3.2267 8.2777 7.9688 7.5412 8.3543 7.0571 1.0776 1.0700 1.0696 1.0334 1.0823 1.0600 1.0369 1.0292 1.0831 1.0667 1.0864 1.0981 1.0910 1.1034 1.0874 1.0986 1.0984 1.1042 1.1003 1.0984 1.0888 1.1049 1.0908 1.0954 1.0936 1.0801
irintensity: 0.3737 0.2381 3.4558 0.4520 0.4216 2.8857 0.2816 0.6829 1.2851 3.4510 1.0988 2.5244 1.3078 0.0889 1.3546 0.9724 0.5949 2.5017 0.1530 5.1029 10.4657 7.5488 4.3376 0.7044 3.3829 1.7923 2.0562 2.6309 1.8243 5.3192 0.7406 7.1127 5.7626 12.4700 67.8718 9.0988 4.2573 7.3948 8.7360 2.5628 1.7230 1.9743 4.8778 1.3737 7.7273 7.4311 17.3774 0.0901 0.6619 15.8439 19.4501 0.1939 7.7154 5.2870 18.3632 75.4069 1.9204 1.9986 13.1781 4.5955 11.0129 6.2144 4.8411 1.5846 3.9595 11.6956 10.1400 17.8284 126.0885 201.6919 6.7337 24.0315 9.5700 3.3302 62.3089 0.2567 0.2530 11.6891 60.2106 5.1148 32.0160 65.4919 11.5282 85.4514 33.4539 69.0049 13.8836 24.0531 38.7036 15.5617 20.3312 70.3521 100.8432 0.8820 21.7590 39.6524 0.2122 12.0763 35.1598 2.5010 23.1196 16.4458 56.3558 4.7683 2.4775 12.0922 13.9784 22.8863 23.5362 8.7049 26.1458 13.0405 1.2777 13.9936 12.5284 6.9175 6.2045 11.6996 12.0259 14.6446 88.4930 3.8625 8.8470 17.0729 37.7341 346.3011 26.8995 5.9279 134.9538 88.5358 62.5702 29.5997 133.2039 72.7243 24.9619 42.9197 13.3616 39.9664 9.0849 25.4422 43.6207 26.1835 58.3448 58.3570 45.5297 13.1953 25.7711 29.6102 29.2249 31.7717 10.7425 16.8651 9.8026 12.6415 0.0497 37.9588
temp: 298.150 k
press: 1.00000 atm
elementType: 8 8 8 8 7 7 6 6 6 6 6 6 6 6 6 6 6 6 6 6 6 6 6 6 6 6 6 6 1 1 1 1 1 1 1 1 1 1 1 1 1 1 1 1 1 1 1 1 1 1 1 1 1 1
symmnumber: 1
zpe: 1163573.0 jmol-1
zpe.correction: 0.443182 hartree
zpe.thermalcorrener: 0.468561 hartree
zpe.thermalcorrenthalpy: 0.469506 hartree
zpe.thermalcorrgfe: 0.388089 hartree
zpe.sumelectzpe: -1262.248814 hartree
zpe.sumelectthermal: -1262.223434 hartree
zpe.sumelectthermalent: -1262.222490 hartree
zpe.sumelectthermalfe: -1262.303906 hartree
dipole: 2.1900 1.1339 2.7140
dipole: 3.6671
quadrupole: -173.7476 -144.0639 -171.3286
quadrupole: -22.1678 11.6177 8.3170
quadrupole: -10.7009 18.9828 -8.2819 -22.1678 11.6177 8.3170
hfenergy: -1262.6919953 hartree
pointgroup: C01 [X(C22H26N2O4)]
dipole: -0.8721225 0.422273 -1.068936 debye
polarizability: 365.9383796|35.8447336|278.3530604|-6.0940411|-4.853841|169.1132467 unknown
InChI: InChI=1S/C22H26N2O4/c1-12-17-10-24-7-6-15-14-5-4-13(26-2)8-19(14)23-21(15)20(24)9-16(17)18(11-28-12)22(25)27-3/h4-5,8,11-12,16-17,20,23H,6-7,9-10H2,1-3H3
charge 0 multiplicity 1
54 atoms
O  -5.104293 -0.687254 0.724811
O  -2.139878 2.962048 -0.375487
O  -3.333092 2.988893 1.62342
O  6.692231 1.174816 -0.231069
N  -1.004252 -2.006442 0.011618
N  1.701967 0.628871 -0.110644
C  -3.251717 -1.306176 -0.839547
C  -2.785169 0.183009 -0.943958
C  -0.564078 -0.582526 0.101003
C  -1.2341 0.209083 -1.044268
C  -2.461937 -2.096842 0.236188
C  -4.764066 -1.406117 -0.561021
C  0.938995 -0.543175 0.055389
C  -0.223032 -2.921341 0.887453
C  1.790798 -1.632108 0.198693
C  1.247009 -3.022082 0.414126
C  -3.379687 0.984992 0.217448
C  3.148746 -1.12972 0.110488
C  -5.670438 -0.858305 -1.671447
C  -4.439617 0.496265 0.948449
C  3.061626 0.295121 -0.081213
C  -2.972625 2.356043 0.594367
C  4.437958 -1.723267 0.179971
C  4.198577 1.127462 -0.203554
C  5.579581 -0.915382 0.061009
C  5.459913 0.495129 -0.12901
C  -1.78303 4.371344 -0.08919
C  6.645191 2.622053 -0.420875
H  -3.048631 -1.789977 -1.814704
H  -3.167016 0.608911 -1.894961
H  -0.912336 -0.137795 1.075714
H  -0.894508 1.257245 -1.051093
H  -0.932273 -0.261835 -1.998531
H  -2.747792 -1.734114 1.256585
H  -2.755634 -3.16241 0.175798
H  -5.042064 -2.449195 -0.324726
H  -0.702266 -3.917296 0.846827
H  -0.243972 -2.581078 1.954185
H  1.291619 -3.613291 -0.522082
H  1.837045 -3.571034 1.174598
H  1.320101 1.562382 -0.244481
H  -6.729941 -0.940308 -1.375451
H  -5.452978 0.201692 -1.888366
H  -5.522121 -1.441245 -2.598782
H  -4.854077 1.044655 1.799794
H  4.548594 -2.803773 0.324041
H  4.099336 2.207496 -0.347099
H  6.58712 -1.339062 0.110293
H  -2.692411 4.993037 -0.034432
H  -1.146913 4.676961 -0.932734
H  -1.243922 4.448042 0.870356
H  6.145558 3.127001 0.430364
H  6.126799 2.890833 -1.363344
H  7.696402 2.942566 -0.473915
