program: Gaussian 09
title: 000251520
version: EM64L-G09RevD.01
frameworkgroup: C1[X(C7H12N2O5)]
method: RPBEPBE
basis: SDD
operation: Freq
keyword: #p
keyword: freq=noraman
keyword: PBEPBE/SDD
title: #p freq=noraman PBEPBE/SDD
converged: YES YES NO NO
title: Mulliken charges:
elementType: O O O O O N N C C C C C C C H H H H H H H H H H H H
charge: -0.321606 -0.413923 -0.405389 -0.242526 -0.264946 -0.406269 -0.418247 -0.368039 -0.377747 -0.460867 -0.465831 0.304237 0.190112 0.214998 0.262218 0.229851 0.227730 0.269648 0.304072 0.244763 0.271717 0.253335 0.292974 0.325303 0.375247 0.379185
chargesum: 0.00000
title: Mulliken charges with hydrogens summed into heavy atoms:
elementType: O O O O O N N C C C C C C C
charge: -0.321606 -0.038676 -0.026204 -0.242526 -0.264946 -0.113295 -0.092944 0.124029 0.119630 0.087969 0.059221 0.304237 0.190112 0.214998
polarizability: 1.40855958e+02 -5.43352636e+00 8.58375737e+01 -1.21104572e+00 4.92507947e+00 9.26427389e+01
1716.lowfreq: -0.0007 -0.0005 -0.0003 1.6699 6.6077 11.4552 17.2099 23.8537 39.7103
frequency: 16.7118 23.8164 39.6790 50.3932 66.8297 70.7733 82.4390 105.2852 180.0915 190.6581 243.7934 264.6626 307.9036 337.3806 373.7152 442.5730 468.6603 504.3869 504.9425 513.5553 596.7030 604.4283 614.2890 637.5386 654.0281 665.4903 716.8369 771.9257 800.1002 854.2527 881.9785 926.3710 1001.4806 1013.0533 1049.3161 1055.0157 1072.7239 1088.2153 1093.6826 1174.1898 1192.1193 1200.3994 1233.3629 1245.8016 1256.1177 1281.9667 1304.8536 1332.2669 1354.2226 1372.4534 1387.3185 1426.6274 1439.6221 1448.9855 1460.1923 1468.2436 1512.5861 1622.6709 1648.7876 1661.9393 2997.1425 3005.7710 3006.2748 3026.3137 3060.0260 3065.5455 3082.9944 3093.8492 3507.0328 3509.1933 3534.7374 3566.0796
redmass: 6.7335 11.7475 7.7183 5.1883 4.2168 6.9015 2.5487 3.3599 6.2074 4.8945 2.5292 4.6989 4.5065 1.2513 3.7450 4.5485 2.1304 2.8042 1.7617 4.0454 2.9939 1.7818 1.6763 1.3383 2.0965 2.2654 8.0757 1.6712 2.6781 2.7851 3.9450 3.1774 2.1817 3.6188 2.3234 2.6454 2.1982 2.4467 2.9941 1.7052 1.2715 1.5541 1.4687 1.5298 1.7287 1.3575 1.1969 1.6890 1.5876 1.5183 1.4653 1.0958 1.1080 1.2722 1.1639 1.2031 2.4687 5.1614 7.3787 8.0635 1.0669 1.0610 1.0615 1.0600 1.0990 1.0975 1.0986 1.1049 1.0639 1.0639 1.0777 1.0781
irintensity: 0.2469 0.8990 0.5377 1.8348 15.0050 2.5145 4.9911 6.6448 2.8008 1.0124 3.6613 0.9407 11.6609 29.5393 25.1581 29.3984 31.2299 36.7240 29.9819 15.9545 37.5413 102.6696 177.5541 126.9419 60.9880 62.0344 4.0049 15.8107 10.0526 13.6760 11.2854 8.1955 6.2610 153.9409 26.8521 229.6158 18.1049 127.5072 89.6977 4.9721 34.0900 6.1484 2.6880 2.2484 164.6675 52.2589 12.0190 88.8312 66.0545 47.5099 70.8441 39.6080 25.3664 53.1869 21.2590 11.4513 615.2876 176.4791 177.9926 225.8549 50.2783 10.6103 12.5630 24.8700 3.3121 15.7249 2.4008 13.6877 27.9308 16.5897 56.0034 15.9705
temp: 298.150 k
press: 1.00000 atm
elementType: 8 8 8 8 8 7 7 6 6 6 6 6 6 6 1 1 1 1 1 1 1 1 1 1 1 1
symmnumber: 1
zpe: 528542.3 jmol-1
zpe.correction: 0.201311 hartree
zpe.thermalcorrener: 0.216864 hartree
zpe.thermalcorrenthalpy: 0.217808 hartree
zpe.thermalcorrgfe: 0.154455 hartree
zpe.sumelectzpe: -758.513581 hartree
zpe.sumelectthermal: -758.498029 hartree
zpe.sumelectthermalent: -758.497084 hartree
zpe.sumelectthermalfe: -758.560437 hartree
dipole: -3.2342 2.0828 -2.2212
dipole: 4.4420
quadrupole: -73.8804 -83.2379 -81.9900
quadrupole: 5.4708 -0.1574 -0.6108
quadrupole: 5.8224 -3.5351 -2.2872 5.4708 -0.1574 -0.6108
hfenergy: -758.7148926 hartree
pointgroup: C01 [X(C7H12N2O5)]
dipole: -1.2197263 -1.0293761 0.7119513 debye
dipolederiv: -0.8904396 -0.0463929 0.0814069 0.0052174 -0.4381325 0.1478085 0.1561752 0.1914616 -0.8998987 -0.5227721 0.3739982 0.2339494 0.3686206 -0.881376 -0.3241452 0.2482109 -0.3399785 -0.665504 -0.9385385 -0.4357447 -0.1853905 -0.5246259 -0.859007 -0.1834865 -0.1394013 -0.1181268 -0.2698433 -0.8080782 -0.253026 -0.1450777 -0.0430669 -0.7142887 -0.2667817 0.024151 -0.2576264 -0.4825141 -0.6301072 -0.2136198 0.0274288 -0.2772152 -0.525822 -0.0309936 -0.2011535 -0.2352206 -0.9227073 -1.1949276 0.1324543 -0.2600327 0.2361966 -0.5350688 0.0114448 -0.62289 0.0123251 -0.6172248 -1.6628517 -0.1038737 -0.0769915 -0.0957989 -0.5460574 -0.0675762 0.0354676 -0.0659871 -0.3653046 0.7751335 -0.0931818 -0.0010067 -0.0914221 0.279337 0.0485826 -0.1276297 0.0233086 0.2093274 0.5857269 0.0050019 0.1406141 -0.0730661 0.3247339 0.0543846 0.4804739 0.075365 0.1963776 -0.5226514 0.0142889 0.0038926 -0.0739337 -0.0117673 -0.1203601 -0.0206214 -0.0925706 0.0145057 -0.1017789 -0.1253599 0.0800023 -0.1083609 -0.0278028 -0.0249861 0.095237 0.0741692 -0.2050914 2.3986442 0.0256026 0.1705022 -0.0534738 0.3590367 -0.2556602 0.1774304 -0.3128724 1.2487781 1.3834619 -0.0319971 -0.0977279 -0.1206856 1.1467775 0.6573998 -0.2060196 0.6593325 0.6599087 1.0659171 0.7147914 0.0326224 0.830851 0.888968 0.1253474 0.1506908 0.2211899 1.1470452 0.0204518 -0.0019746 -0.0032577 -0.0255542 -0.0534788 0.0327185 0.0937485 0.0683066 0.061407 0.0091856 0.0007873 -0.0628588 0.0400254 0.0874167 -0.0103663 -0.0781705 -0.0266187 -0.0937355 -0.1435182 0.1082401 -0.0198989 0.1056921 -0.0457718 -0.0401122 -0.025052 -0.0987476 0.0611971 0.1481012 -0.0536969 0.0765425 -0.0256991 0.0771196 0.0262485 -0.0228671 0.0367571 0.0130928 0.1660962 -0.0253115 -0.0346962 -0.03039 0.1203406 -0.000411 0.0049852 -0.0282817 -0.0053094 0.0815165 -0.0249236 0.03188 0.0093598 -0.0635739 0.0438877 0.0518337 0.0659786 0.0718113 0.0748722 0.0672613 0.0603854 0.0443588 -0.0203713 -0.0159655 0.0393466 -0.0139331 0.0966939 -0.0609063 -0.0084795 -0.1059485 -0.0424465 0.0837801 0.0470666 -0.1023841 0.0189202 0.0296288 0.0633384 0.000256 0.0303424 -0.0249969 0.3172455 0.0646017 0.0311987 0.0610558 0.1162638 0.2608329 0.069603 -0.0061148 0.0953406 0.3622471 0.0872114 -0.0828381 0.0589984 0.1338962 0.0818789 -0.0524791 -0.0073503 -0.0987683 0.321099 -0.035513 -0.0388317 -0.0405555 0.363824 0.3614125 -0.0422239 0.0367831 -0.026158 0.3544166 0.0296554 0.0789094 0.0633503 0.1033754 unknown
polarizability: 140.2874603|7.751557|84.8416954|1.6813478|3.3291934|94.2071144 unknown
InChI: InChI=1S/C7H12N2O5/c10-5(11)1-3-8-7(14)9-4-2-6(12)13/h8-10,12H,1-4H2
charge 0 multiplicity 1
26 atoms
O  0.295448 1.223316 -1.128504
O  4.789758 -1.409012 -0.837729
O  -4.928973 -1.788285 -0.137194
O  5.060694 0.508119 0.442776
O  -3.777675 -0.542369 1.440474
N  0.776999 0.657496 1.084543
N  -1.461522 0.828884 0.376176
C  2.226469 0.776271 0.874493
C  -2.508458 1.061776 -0.619636
C  2.791366 -0.401241 0.048581
C  -3.300502 -0.217873 -0.97124
C  -0.111105 0.921231 0.041363
C  4.297621 -0.344149 -0.065992
C  -3.989594 -0.824122 0.235125
H  2.443531 1.720281 0.345276
H  2.721545 0.82621 1.85948
H  -3.205435 1.841397 -0.257106
H  -2.006138 1.441756 -1.525272
H  2.349436 -0.380144 -0.964477
H  2.510185 -1.373919 0.495178
H  -2.619172 -0.980894 -1.39503
H  -4.06125 -0.012019 -1.746551
H  0.429287 0.428944 2.015402
H  -1.774645 0.547273 1.307886
H  5.781546 -1.336914 -0.89564
H  -5.344613 -2.182315 0.678015
