program: Gaussian 09
title: 000251527
version: EM64L-G09RevD.01
frameworkgroup: C1[X(C16H18O2)]
method: RPBEPBE
basis: SDD
operation: Freq
keyword: #pfreq=noraman
keyword: PBEPBE/SDD
title: #p freq=noraman PBEPBE/SDD
converged: YES YES NO NO
title: Mulliken charges:
elementType: O O C C C C C C C C C C C C C C C C H H H H H H H H H H H H H H H H H H
charge: -0.237256 -0.433010 -0.194273 -0.191292 -0.508383 0.517847 -0.440619 -0.598279 -0.435718 -0.529974 0.469591 -0.567104 0.184476 -0.368641 -0.382195 -0.374146 -0.424648 0.283180 0.249472 0.226763 0.217816 0.212574 0.213768 0.213397 0.230479 0.237482 0.209298 0.208326 0.224529 0.245236 0.256485 0.227348 0.233096 0.251190 0.219095 0.354091
chargesum: 0.00000
title: Mulliken charges with hydrogens summed into heavy atoms:
elementType: O O C C C C C C C C C C C C C C C C
charge: -0.237256 -0.078920 0.055199 0.035471 -0.077993 0.517847 -0.013454 -0.130319 -0.018094 -0.060208 0.469591 -0.310619 0.184476 -0.141292 -0.149099 -0.122956 -0.205552 0.283180
polarizability: 2.38327203e+02 -1.58264710e+00 1.63910967e+02 6.46626114e+00 -3.26499949e+00 1.23586911e+02
1716.lowfreq: -20.8392 -12.8097 -1.4343 -0.0009 -0.0008 -0.0006 19.5047 34.4081 67.9240
frequency: 19.1111 34.2042 67.8618 76.2179 137.3944 171.3693 187.4379 221.4498 260.3917 286.9587 314.1895 340.2159 354.9877 363.8190 389.1413 410.1480 421.7801 441.8529 469.0036 481.4384 491.4512 520.2921 527.2672 613.1091 635.7981 653.3792 657.9430 701.1471 727.7507 769.6101 775.9392 805.9708 813.9403 836.7294 849.1967 858.4032 887.4975 906.6776 917.4686 929.5325 961.1966 971.4318 986.9998 1002.9958 1018.5391 1047.1542 1061.4170 1083.3950 1099.2003 1121.0758 1124.8465 1144.1295 1147.6385 1157.8011 1177.0037 1185.8544 1188.5982 1205.1916 1229.4840 1251.6924 1260.8230 1268.4664 1283.6462 1295.0791 1308.7239 1319.2868 1321.3703 1324.4126 1343.7858 1349.1457 1353.6528 1368.3229 1385.4298 1422.6421 1441.8329 1452.1097 1463.4765 1472.6076 1482.2816 1507.4427 1584.9345 1593.8205 1627.6544 1630.0718 2933.0243 2947.3107 2954.3404 2970.3097 2974.7395 2980.7810 2993.1320 3027.8993 3037.3122 3042.8808 3052.1253 3067.1586 3111.4411 3123.1266 3128.3687 3152.2120 3168.7191 3581.6226
redmass: 4.8259 4.5556 4.0570 5.2007 5.5548 3.3007 3.1352 3.4381 3.3746 4.9091 2.4575 2.4101 1.1158 3.3536 3.7927 3.1251 4.3193 3.1409 3.9363 3.2648 3.2985 2.5576 2.6619 3.4410 5.9417 4.4707 3.3789 3.1097 2.7343 2.6278 2.0820 1.7586 2.5390 1.7178 2.5369 1.8993 1.8733 2.0738 1.6491 1.3826 1.3693 2.2718 1.8637 2.8921 2.0610 2.0505 2.1860 1.8777 1.7701 1.5907 1.9275 1.3538 1.2528 1.6515 1.6512 1.4405 1.2536 1.3828 1.3724 2.2577 1.3536 1.8509 1.3549 1.5498 1.5564 1.5703 1.4309 1.4738 1.5939 1.4379 1.5298 1.8355 4.3554 3.1414 1.0832 1.0905 1.0879 1.0889 1.0899 2.5976 9.8518 6.3970 6.3792 7.7345 1.0790 1.0799 1.0656 1.0673 1.0604 1.0612 1.0646 1.1014 1.1009 1.0939 1.1004 1.0950 1.0891 1.0914 1.0885 1.0933 1.0954 1.0660
irintensity: 1.5395 1.5741 1.8237 2.3121 0.5100 2.3284 1.3386 0.9635 1.0071 0.6796 1.2678 2.3551 143.4461 3.2052 13.1815 0.5850 8.1804 2.1058 3.9996 5.1352 2.8375 5.2612 21.1134 5.4786 0.2800 2.6102 13.9765 0.8442 5.1662 9.4981 2.2697 26.0061 11.7436 47.7699 5.3114 13.2096 6.9453 8.5438 20.7298 0.2063 0.5351 1.8324 7.8736 4.9248 1.5049 7.7277 0.4603 4.6608 43.5272 33.8707 1.4382 179.3803 28.1714 18.4821 2.3972 16.8061 6.0664 21.1209 3.5909 18.6069 24.7799 43.2300 3.3159 2.9532 9.1546 10.9141 4.3758 5.9913 11.7625 2.6178 26.4370 7.5947 11.9394 5.1140 14.2200 14.2613 0.5606 22.9944 24.3285 105.1846 182.0587 12.4479 45.4211 177.8554 7.9833 14.6974 9.9675 10.8025 8.8205 70.8401 62.8126 10.7234 59.7333 36.1219 47.9905 23.6752 22.4459 9.2048 14.2052 20.1706 5.5822 41.2452
temp: 298.150 k
press: 1.00000 atm
elementType: 8 8 6 6 6 6 6 6 6 6 6 6 6 6 6 6 6 6 1 1 1 1 1 1 1 1 1 1 1 1 1 1 1 1 1 1
symmnumber: 1
zpe: 787150.2 jmol-1
zpe.correction: 0.299810 hartree
zpe.thermalcorrener: 0.315267 hartree
zpe.thermalcorrenthalpy: 0.316212 hartree
zpe.thermalcorrgfe: 0.256110 hartree
zpe.sumelectzpe: -769.625132 hartree
zpe.sumelectthermal: -769.609674 hartree
zpe.sumelectthermalent: -769.608730 hartree
zpe.sumelectthermalfe: -769.668832 hartree
dipole: -4.1967 -0.9190 2.3157
dipole: 4.8805
quadrupole: -145.3376 -91.1294 -109.5046
quadrupole: 7.1033 10.4757 -0.8933
quadrupole: -30.0137 24.1945 5.8193 7.1033 10.4757 -0.8933
hfenergy: -769.9249413 hartree
pointgroup: C01 [X(C16H18O2)]
dipole: -1.6569334 -0.3783047 0.8935193 debye
polarizability: 238.2208647|-1.1992599|163.9467837|7.4739441|-2.903053|123.6574332 unknown
InChI: InChI=1S/C16H18O2/c17-15-6-3-11(4-7-15)12-1-2-14-10-16(18)8-5-13(14)9-12/h3-4,6-7,10,12-13,17H,1-2,5,8-9H2
charge 0 multiplicity 1
36 atoms
O  5.317664 -0.396683 -1.18559
O  -5.268711 -1.317831 -1.144951
C  1.431977 -0.438333 0.577587
C  -0.572116 1.138401 1.217856
C  0.564494 0.203034 1.705125
C  1.879329 0.602952 -0.445044
C  0.060605 2.228521 0.302938
C  0.827553 1.600808 -0.887881
C  2.632681 -1.196154 1.195558
C  3.662678 -1.635092 0.1334
C  -1.774383 0.43107 0.565538
C  3.145158 0.608499 -0.97427
C  4.144254 -0.445875 -0.703103
C  -2.838156 1.209427 0.027597
C  -1.925752 -0.977544 0.531755
C  -3.986172 0.621088 -0.533939
C  -3.070142 -1.5900 -0.028364
C  -4.100427 -0.787704 -0.568226
H  0.797657 -1.167079 0.02464
H  -0.964506 1.658858 2.118157
H  1.24063 0.806579 2.343908
H  0.166837 -0.602108 2.353325
H  0.75902 2.836772 0.911441
H  -0.710414 2.9196 -0.082875
H  1.284752 2.388272 -1.514311
H  0.088615 1.070207 -1.526499
H  2.267423 -2.075171 1.760986
H  3.132905 -0.529576 1.927086
H  3.201699 -2.367439 -0.562651
H  4.54079 -2.128271 0.585489
H  3.453516 1.38904 -1.681986
H  -2.777862 2.303704 0.058081
H  -1.155127 -1.625431 0.960736
H  -4.799435 1.229007 -0.94126
H  -3.154964 -2.684795 -0.038835
H  -5.257563 -2.306751 -1.119118
