program: Gaussian 09
title: 000251512
version: EM64L-G09RevD.01
frameworkgroup: C1[X(C14H18O2)]
method: RPBEPBE
basis: SDD
operation: Freq
keyword: #pfreq=noraman
keyword: PBEPBE/SDD
title: #p freq=noraman PBEPBE/SDD
converged: YES YES NO NO
title: Mulliken charges:
elementType: O O C C C C C C C C C C C C C C H H H H H H H H H H H H H H H H H H
charge: -0.298957 -0.265396 -0.378641 0.048648 -0.351294 -0.717817 -0.693629 0.236100 -0.365569 0.475961 -0.255679 -0.366599 -0.383412 -0.235954 -0.233099 -0.233090 0.185706 0.203090 0.226273 0.222593 0.193480 0.219506 0.251321 0.212239 0.217921 0.206671 0.210741 0.247693 0.259403 0.231176 0.236763 0.229584 0.231370 0.232897
chargesum: 0.00000
title: Mulliken charges with hydrogens summed into heavy atoms:
elementType: O O C C C C C C C C C C C C C C
charge: -0.298957 -0.265396 0.010155 0.274921 0.064779 -0.034751 -0.058296 0.236100 -0.117877 0.475961 0.003724 -0.135422 -0.146649 -0.006370 -0.001729 -0.000192
polarizability: 2.81754424e+02 -1.76969455e+01 1.39766744e+02 9.17559372e+00 2.26174795e+01 1.10221768e+02
1716.lowfreq: -18.9794 -2.6262 -0.0008 -0.0007 -0.0005 3.0623 25.3489 30.9329 49.2728
frequency: 23.1729 30.8787 49.1246 61.1599 77.6064 90.7359 107.7439 153.9341 168.6104 185.2670 216.4082 220.8003 232.1646 271.0119 280.5624 311.6687 371.4889 402.6713 450.7490 466.2562 492.7418 503.9690 565.8959 615.2825 672.0227 698.8751 706.4575 732.8114 775.4470 777.7597 846.9812 849.0298 866.7262 876.1047 891.8816 929.4967 936.0136 959.7480 980.8447 988.8691 989.7195 998.0558 1016.1358 1025.9098 1029.8628 1070.1076 1083.6550 1112.3072 1130.3162 1134.6221 1171.3763 1174.2690 1191.2126 1217.3107 1235.3949 1269.5803 1288.4124 1296.5485 1301.8446 1330.5631 1333.8214 1338.4494 1361.4235 1385.6676 1387.2682 1391.7642 1440.5949 1449.6791 1465.1925 1474.7540 1477.2467 1478.3076 1485.5308 1485.8574 1582.1134 1598.6998 1613.0249 1647.1346 2971.0048 2973.5777 2979.6737 2989.0564 3010.2654 3024.8096 3044.7107 3071.1246 3073.4465 3085.5275 3099.7844 3101.0225 3124.1732 3129.4373 3141.9396 3152.1706 3157.0298 3167.7879
redmass: 3.6659 4.0903 4.5838 3.7932 1.8718 4.1724 3.3166 2.8367 3.4207 2.2523 1.3714 2.1134 1.4074 4.8748 2.9755 3.9446 3.1130 2.7595 2.6934 3.5759 3.0066 3.4860 6.3813 6.4250 4.9147 1.6787 4.6043 1.4088 1.9483 2.4231 3.9837 1.2832 1.3204 1.8341 1.8044 1.4725 2.1661 4.3258 1.3885 6.0177 1.4298 1.3129 1.1989 2.1966 2.0362 2.5103 1.5975 2.3709 2.2984 2.2526 2.0486 1.0724 1.1278 1.6191 1.3643 1.2961 1.1009 2.0286 1.3943 1.4745 1.2939 1.3602 1.7108 1.2271 6.9452 1.2177 2.2903 1.0814 1.0553 1.0563 1.0431 1.0461 2.1762 1.1091 5.7092 10.0076 6.4478 5.7443 1.0457 1.0496 1.0625 1.0366 1.0883 1.0939 1.1013 1.1012 1.0991 1.0988 1.0898 1.1006 1.0865 1.0869 1.0916 1.0961 1.0919 1.1015
irintensity: 0.0162 0.8266 1.1586 0.2879 0.0836 0.1445 0.6465 0.7113 2.5400 1.0923 0.5055 0.6824 0.6975 7.3665 0.9289 2.1048 3.1324 0.0238 6.2171 3.6835 13.6343 3.5499 16.5624 0.1674 5.9573 42.6947 4.6409 3.5378 65.8144 9.2020 19.8251 0.4945 1.6607 9.0146 10.2104 0.0119 7.5217 64.2548 0.2570 2.6842 34.3683 5.1310 42.7272 1.2201 49.6310 47.0028 12.9520 396.1424 187.8281 63.8698 2.3151 2.8954 12.4756 35.9559 2.0744 4.0257 0.1770 84.0711 59.4245 2.0074 0.7030 23.8982 8.2386 22.5925 14.9626 10.0773 16.5626 2.6033 10.1088 3.0325 22.5365 0.9516 14.2979 17.0867 9.2606 240.9933 25.9405 159.3471 18.9694 33.0445 47.8596 36.9592 3.6535 8.3784 12.9506 81.2940 47.8258 54.0052 2.0864 22.0017 5.3763 0.3674 11.5585 27.7348 13.5923 28.5382
temp: 298.150 k
press: 1.00000 atm
elementType: 8 8 6 6 6 6 6 6 6 6 6 6 6 6 6 6 1 1 1 1 1 1 1 1 1 1 1 1 1 1 1 1 1 1
symmnumber: 1
zpe: 745269.0 jmol-1
zpe.correction: 0.283858 hartree
zpe.thermalcorrener: 0.300706 hartree
zpe.thermalcorrenthalpy: 0.301651 hartree
zpe.thermalcorrgfe: 0.237114 hartree
zpe.sumelectzpe: -693.539356 hartree
zpe.sumelectthermal: -693.522508 hartree
zpe.sumelectthermalent: -693.521564 hartree
zpe.sumelectthermalfe: -693.586100 hartree
dipole: -0.9114 1.5861 1.0024
dipole: 2.0859
quadrupole: -73.5068 -97.8633 -97.8108
quadrupole: -1.8419 2.0988 1.9280
quadrupole: 16.2202 -8.1363 -8.0838 -1.8419 2.0988 1.9280
hfenergy: -693.8232143 hartree
pointgroup: C01 [X(C14H18O2)]
dipole: -0.3444875 0.6898647 0.2808956 debye
polarizability: 279.0675003|-21.8009226|147.3001598|19.4667173|15.7886299|105.375276 unknown
InChI: InChI=1S/C14H18O2/c1-3-7-12(2)16-14(15)11-10-13-8-5-4-6-9-13/h4-6,8-12H,3,7H2,1-2H3
charge 0 multiplicity 1
34 atoms
O  2.098982 -0.268658 0.654128
O  1.12429 -2.086743 -0.461668
C  4.471752 0.223502 0.562583
C  3.45225 -0.925162 0.560066
C  4.381338 1.138585 -0.678371
C  3.603804 -1.901562 1.734613
C  5.410322 2.288801 -0.640418
C  1.014343 -0.965141 0.102025
C  -0.227491 -0.18445 0.279477
C  -2.734854 -0.006429 -0.112639
C  -1.419838 -0.655769 -0.198099
C  -2.943133 1.256213 0.517056
C  -3.858613 -0.66719 -0.688041
C  -4.226968 1.831744 0.565449
C  -5.144865 -0.090791 -0.639921
C  -5.334417 1.162235 -0.01276
H  5.485502 -0.223077 0.622614
H  4.331277 0.823286 1.483919
H  3.475833 -1.478779 -0.398634
H  3.357595 1.553228 -0.74353
H  4.535072 0.530803 -1.593341
H  3.52545 -1.367378 2.69826
H  2.826974 -2.683408 1.694042
H  4.591389 -2.396454 1.689745
H  5.328353 2.932522 -1.535264
H  6.445411 1.899269 -0.598482
H  5.256434 2.927347 0.24999
H  -0.125695 0.77207 0.801486
H  -1.386866 -1.631478 -0.705838
H  -2.098074 1.786954 0.96898
H  -3.713056 -1.639171 -1.175173
H  -4.370898 2.802555 1.052597
H  -5.995824 -0.614564 -1.088749
H  -6.331681 1.614088 0.026797
