program: Gaussian 09
title: 000251507
version: EM64L-G09RevD.01
frameworkgroup: C1[X(C7H14O4)]
method: RPBEPBE
basis: SDD
operation: Freq
keyword: #pfreq=noraman
keyword: PBEPBE/SDD
title: #p freq=noraman PBEPBE/SDD
converged: YES YES NO NO
title: Mulliken charges:
elementType: O O O O C C C C C C C H H H H H H H H H H H H H H
charge: -0.282131 -0.305511 -0.448604 -0.444110 -0.148230 -0.082520 -0.525666 -0.018356 -0.317507 -0.198340 -0.680111 0.254088 0.237703 0.272202 0.226467 0.239331 0.203281 0.223868 0.360146 0.196731 0.218331 0.348793 0.213120 0.226615 0.230410
chargesum: 0.00000
title: Mulliken charges with hydrogens summed into heavy atoms:
elementType: O O O O C C C C C C C
charge: -0.282131 -0.305511 -0.088458 -0.095317 0.105858 0.155183 -0.026997 0.220975 0.109641 0.216722 -0.009966
polarizability: 9.74390899e+01 3.32675016e+00 8.52413058e+01 -1.60623767e+00 1.50027695e+00 7.92940859e+01
1716.lowfreq: -10.2581 -2.3289 -0.0005 0.0003 0.0005 7.2830 33.0325 61.3354 93.1293
frequency: 32.4491 61.1088 93.0651 102.8851 130.4208 177.9813 212.7557 245.9481 297.3846 332.5064 374.7389 402.4181 437.3933 456.5528 485.6209 523.8211 629.2327 729.5687 745.7411 768.8437 793.9083 813.6759 834.0401 887.8668 904.3307 956.2905 961.2404 967.5620 1023.7120 1025.5353 1045.0938 1066.7996 1097.9366 1115.0731 1138.8135 1167.5061 1181.5706 1193.8298 1250.1951 1255.5026 1276.4947 1294.1724 1296.1184 1305.5597 1313.9685 1337.4473 1371.3044 1383.5397 1397.4740 1416.9610 1443.2111 1457.1566 1463.0259 1479.5333 1492.4971 2958.9373 2994.0156 2999.2667 3015.3269 3026.2850 3027.9320 3041.8818 3082.6423 3091.1762 3091.7340 3101.0691 3117.8228 3395.8773 3545.9299
redmass: 3.0745 3.1000 2.6474 3.3655 3.3665 4.7362 2.6926 1.3840 4.0946 4.7371 3.8178 2.5300 1.1783 2.3499 3.4598 4.8087 1.1027 5.4881 3.3712 3.6892 3.0099 1.2178 3.2624 2.4297 3.5202 2.2380 3.9681 2.2054 2.2140 2.9419 3.5689 2.3648 1.9345 2.0733 1.4492 1.3808 1.2796 1.3786 1.1684 1.4955 1.3462 1.3196 1.4057 1.2513 1.3481 1.2059 1.3289 1.3027 1.2721 1.1820 1.1006 1.0897 1.0409 1.0489 1.0811 1.0598 1.0361 1.0675 1.0815 1.0814 1.1014 1.0708 1.0900 1.0993 1.0991 1.1013 1.1031 1.0658 1.0656
irintensity: 0.2705 0.8655 2.6885 4.5443 6.2464 2.0230 3.5449 2.2241 4.8535 2.4462 4.2290 1.9668 126.8276 2.0209 7.9770 6.7340 126.2132 14.7832 15.2220 20.4300 71.0941 24.2783 16.8685 9.1855 132.1978 22.9343 78.2143 28.3565 57.0341 30.6852 103.9555 129.3743 20.0781 26.1463 6.7132 22.7866 4.7752 5.7449 1.4301 5.7830 4.3456 18.1022 2.8836 24.1048 10.6715 13.8188 4.2568 22.7612 23.0570 47.3404 16.8200 9.3096 11.1875 6.3523 7.9685 52.2846 19.9538 18.6419 45.0112 31.8095 19.9950 41.0564 20.0779 69.1728 16.7249 36.5616 10.3573 108.4957 6.1859
temp: 298.150 k
press: 1.00000 atm
elementType: 8 8 8 8 6 6 6 6 6 6 6 1 1 1 1 1 1 1 1 1 1 1 1 1 1
symmnumber: 1
zpe: 551115.3 jmol-1
zpe.correction: 0.209909 hartree
zpe.thermalcorrener: 0.221925 hartree
zpe.thermalcorrenthalpy: 0.222869 hartree
zpe.thermalcorrgfe: 0.171186 hartree
zpe.sumelectzpe: -575.098358 hartree
zpe.sumelectthermal: -575.086342 hartree
zpe.sumelectthermalent: -575.085398 hartree
zpe.sumelectthermalfe: -575.137081 hartree
dipole: 2.7852 -1.3186 -2.2698
dipole: 3.8273
quadrupole: -65.9903 -68.6546 -70.1434
quadrupole: 10.5775 -0.3519 4.4114
quadrupole: 2.2725 -0.3918 -1.8806 10.5775 -0.3519 4.4114
hfenergy: -575.3082672 hartree
pointgroup: C01 [X(C7H14O4)]
dipole: -1.1278668 -0.3688654 0.9269109 debye
dipolederiv: -1.1081599 -0.0819251 0.0724117 -0.2615573 -0.544641 -0.0316041 0.1686442 0.0821523 -0.4935687 -1.1338243 0.3079864 -0.1447912 0.413269 -0.7115589 0.1353336 -0.3213447 0.0847058 -0.5718131 -0.5177163 -0.086008 -0.1663837 -0.102478 -0.5666205 0.0422297 -0.1029441 0.004784 -0.6745483 -0.297638 -0.0506946 -0.1610541 -0.1493167 -0.8243301 -0.0025181 -0.1758118 -0.0435543 -0.4807312 0.3728553 -0.0201268 0.1922428 0.0277757 0.2730579 -0.066415 0.1452545 0.0464945 0.5046058 0.579973 -0.0655913 -0.149163 -0.2256423 0.0393344 -0.0651904 -0.1979777 -0.019966 0.1953425 -0.1265526 0.0074627 0.1165943 -0.0130301 -0.1345325 0.0404869 0.0108257 -0.0420696 -0.0701804 1.3264827 -0.0521196 0.129662 0.2593453 0.5344089 -0.0701108 0.4107613 -0.1558166 0.6521036 0.2757371 0.0521888 0.0647391 0.1233822 0.5322347 0.1514417 0.0977866 0.0851634 0.3029722 0.6149392 -0.1935501 -0.0252842 -0.379697 0.587105 -0.0884037 -0.0610991 -0.0387713 0.2931171 -0.0484542 0.048037 -0.0841316 0.0658684 0.0262576 0.0282931 -0.0916342 0.0311911 -0.0322811 -0.058486 0.1075818 -0.0103414 0.1036102 -0.0004542 -0.0122311 0.0174544 -0.0363311 0.0368506 -0.1230427 0.0338511 -0.0622133 0.0521744 0.049624 0.0022256 -0.0853311 0.0306206 -0.0501296 0.0204588 -0.1168816 -0.010489 -0.0873267 0.0009551 -0.0193614 -0.0279787 -0.0414852 0.0878536 0.0207342 0.0758256 -0.0776065 0.0507896 0.0693761 0.0425046 -0.0625012 0.0698685 -0.0778685 -0.0847718 0.0042071 0.0966336 0.01284 0.0459008 -0.0445788 0.0487384 0.0221154 -0.1320553 -0.091683 0.0013915 -0.1505765 0.0021892 0.0013798 0.0009656 -0.107648 -0.0062695 -0.0214705 -0.0554245 0.044268 0.1091705 0.0121864 0.0329988 -0.0445385 0.0788844 -0.0462387 0.0277853 0.3350876 0.0062727 -0.0168356 0.0336479 0.3221336 0.0238754 -0.0540196 0.0585654 0.3162241 -0.0371044 0.0542374 0.0678233 0.0592983 0.0032236 0.0515038 0.1310939 -0.0274074 -0.1683781 -0.0451053 -0.1193755 -0.0284971 -0.0204107 -0.1161022 0.0033097 0.0043685 -0.0091854 0.0479907 0.1442252 0.0349795 0.1452212 0.0574204 0.3850769 -0.0366306 0.1203687 -0.0541231 0.2312135 0.0023418 0.1187516 -0.0157119 0.1445737 -0.0791449 -0.0077846 -0.0071778 -0.0244664 0.0886679 0.0284448 -0.0084914 0.1250502 -0.0235074 0.1103065 -0.0146009 0.0740703 0.0096566 -0.0900981 0.0066835 -0.1022773 -0.0164696 -0.1554046 -0.0359894 -0.0182016 -0.0127829 0.020367 0.078396 unknown
polarizability: 97.2486508|-3.8496028|85.0155027|-0.8810568|-2.2294747|79.7103281 unknown
InChI: InChI=1S/C7H14O4/c1-2-10-7-3-5(9)6(4-8)11-7/h5-9H,2-4H2,1H3
charge 0 multiplicity 1
25 atoms
O  0.544363 0.393937 1.109011
O  -1.514672 -0.340416 0.043126
O  0.498051 -1.419444 -1.607351
O  2.435191 2.15271 -0.150525
C  1.139321 -1.516136 -0.294171
C  1.660218 -0.152699 0.239575
C  0.121871 -1.93043 0.803416
C  -0.545596 -0.586333 1.121523
C  2.005123 0.910529 -0.804699
C  -2.267967 0.929001 0.190078
C  -3.237979 1.029633 -0.985119
H  1.960134 -2.238557 -0.421779
H  2.520637 -0.300414 0.920332
H  -0.592516 -2.684968 0.440578
H  0.640197 -2.309082 1.701446
H  -1.042934 -0.490449 2.104284
H  1.13739 1.080795 -1.470802
H  2.860427 0.583324 -1.418539
H  -0.388395 -0.98028 -1.457675
H  -2.80907 0.905631 1.159659
H  -1.553304 1.774394 0.206383
H  1.731149 2.396504 0.504984
H  -3.83812 1.954044 -0.904004
H  -2.691859 1.05624 -1.944284
H  -3.925259 0.166468 -0.999947
