program: Gaussian 09
title: 000251529
version: EM64L-G09RevD.01
frameworkgroup: C1[X(C18H24O2)]
method: RPBEPBE
basis: SDD
operation: Freq
keyword: #pfreq=noraman
keyword: PBEPBE/SDD
title: #p freq=noraman PBEPBE/SDD
converged: YES YES NO NO
title: Mulliken charges:
elementType: O O C C C C C C C C C C C C C C C C C C H H H H H H H H H H H H H H H H H H H H H H H H
charge: -0.300890 -0.267860 0.333112 -0.476816 -0.454447 -0.733187 -0.092045 -0.312970 0.312546 0.369623 -0.661649 -0.595247 0.450045 -0.794310 -0.785022 -0.364661 -0.416326 -0.221148 -0.221283 -0.242350 0.199272 0.229774 0.223743 0.229073 0.220540 0.224761 0.267880 0.265007 0.211706 0.240394 0.234056 0.218501 0.215869 0.217379 0.230024 0.219444 0.215525 0.214862 0.227086 0.260114 0.230098 0.226043 0.225653 0.228079
chargesum: 0.00000
title: Mulliken charges with hydrogens summed into heavy atoms:
elementType: O O C C C C C C C C C C C C C C C C C C
charge: -0.300890 -0.267860 0.333112 -0.047770 -0.001631 -0.020006 0.172962 -0.101264 0.312546 0.369623 -0.187199 -0.160877 0.450045 -0.127463 -0.127549 -0.104547 -0.186228 0.004896 0.004371 -0.014271
polarizability: 2.22402816e+02 9.60185403e+00 2.05995094e+02 1.40561323e+01 1.31740841e+00 1.64853539e+02
1716.lowfreq: -12.6747 -9.3905 -6.6016 0.0004 0.0006 0.0008 5.1856 16.1309 20.0345
frequency: -10.1530 16.0809 19.6108 25.3044 37.0597 59.8197 70.8643 104.2250 107.0505 117.8380 122.0763 135.1450 182.8444 189.9003 205.7362 226.5545 266.9952 273.3964 290.4490 296.3142 306.3953 339.7949 369.6408 380.0165 404.1062 414.3453 425.4268 464.5320 469.5705 507.0456 523.2227 546.6944 613.9837 623.7394 679.2689 690.9550 702.6174 718.1576 739.0640 760.2618 793.1972 823.6410 828.9405 853.2047 853.6601 898.1540 921.8885 927.6605 942.2497 945.2113 947.4241 973.3095 976.6853 989.8351 993.5894 995.3794 1008.3702 1017.5601 1027.4312 1029.3544 1053.5310 1062.9606 1079.3020 1082.0088 1104.2930 1119.9659 1130.0264 1171.9617 1174.8232 1190.0236 1202.5364 1223.6679 1232.7595 1256.8678 1270.7377 1283.3540 1299.8869 1310.5096 1333.2648 1342.2590 1358.8972 1377.7952 1383.2802 1388.4405 1398.4004 1421.2133 1439.9645 1453.1131 1454.2019 1455.3873 1461.3865 1467.5984 1472.4112 1473.8575 1482.3769 1483.3533 1486.6531 1594.3174 1609.7433 1622.7888 1653.0599 1695.3046 2956.0840 2962.9697 2986.0171 2991.5199 2995.7164 3013.2694 3026.9225 3030.3908 3041.2428 3054.1513 3076.4764 3081.3660 3086.1245 3094.4942 3096.1791 3097.0931 3119.7908 3119.8495 3126.5447 3132.6137 3138.8090 3149.2011 3163.8195 3198.9591
redmass: 4.7475 3.2637 3.4935 3.3832 3.9317 2.7505 2.2991 4.0870 1.2612 3.3613 4.1426 2.9672 1.1847 3.0613 4.1817 1.1251 2.4229 2.5717 2.6886 2.5517 3.7988 2.6433 2.7238 2.9549 2.8145 2.6517 2.6988 2.8623 2.3648 4.1113 3.7207 2.7717 5.4104 3.6068 2.0345 4.5081 2.4794 2.3175 1.6712 2.5406 2.1549 2.5535 2.4011 1.3093 1.5421 3.2351 1.8882 1.8025 1.3428 1.9428 1.3955 1.8702 1.3937 5.2757 1.2526 1.3635 1.1400 2.1518 2.2278 1.5979 1.8386 1.9848 1.6924 1.6660 1.8071 2.1609 2.2592 1.0863 1.5307 1.1403 2.6697 1.9474 1.9791 2.0871 1.3203 1.5911 1.3247 1.3232 1.2866 1.4280 1.4509 1.2032 7.9749 1.3149 1.2310 1.1816 2.0737 1.0715 1.1364 1.0507 1.0601 1.0805 1.0459 1.0774 1.0642 2.1552 1.0892 6.1899 6.3636 8.7250 4.6781 6.4857 1.0372 1.0386 1.0577 1.0427 1.0617 1.0622 1.0970 1.0963 1.0969 1.0897 1.0985 1.0964 1.0992 1.0952 1.0605 1.0993 1.0859 1.0987 1.0874 1.0933 1.0922 1.0963 1.1017 1.1137
irintensity: 0.1309 0.0884 0.0345 0.0352 0.7418 0.1941 0.3484 2.3898 0.0863 1.7169 0.4914 0.2151 1.0690 5.7881 1.6149 0.5717 2.2874 1.1887 0.4072 1.3150 3.3899 3.2399 3.2385 2.5020 0.0436 1.9212 0.4859 2.2245 2.5925 6.3714 17.2115 12.6768 0.2972 2.3489 12.5871 13.2460 15.4024 63.3424 3.1348 29.2229 2.0565 3.4481 21.7034 3.2796 14.6438 57.6946 0.6302 1.4783 67.6518 16.7230 1.6620 4.0140 0.2823 1.9457 4.3292 0.0927 11.9868 57.3410 7.0963 16.8567 7.1945 127.7984 13.8332 3.0313 196.9082 11.5270 11.8768 6.6210 31.0737 0.9800 1.3359 89.9064 56.7839 15.5349 9.7571 72.4609 3.2907 4.0115 12.4685 3.2812 3.2752 30.0290 1.1950 26.9970 8.5984 18.4941 8.7579 9.8519 16.1194 3.7177 9.1991 10.1427 21.6859 9.0237 13.1070 17.7062 15.8307 5.2578 39.5388 141.3904 4.0294 2.5473 42.5973 54.5109 3.3749 8.4418 50.7972 12.3776 4.8804 50.2569 12.6751 11.7127 9.7434 37.8954 48.7884 42.5558 9.9772 7.2343 3.1777 11.2809 1.0756 3.4423 23.0809 29.5709 20.3330 25.1343
temp: 298.150 k
press: 1.00000 atm
elementType: 8 8 6 6 6 6 6 6 6 6 6 6 6 6 6 6 6 6 6 6 1 1 1 1 1 1 1 1 1 1 1 1 1 1 1 1 1 1 1 1 1 1 1 1
symmnumber: 1
zpe: 971790.8 jmol-1
zpe.correction: 0.370136 hartree
zpe.thermalcorrener: 0.391515 hartree
zpe.thermalcorrenthalpy: 0.392459 hartree
zpe.thermalcorrgfe: 0.317039 hartree
zpe.sumelectzpe: -849.219563 hartree
zpe.sumelectthermal: -849.198184 hartree
zpe.sumelectthermalent: -849.197240 hartree
zpe.sumelectthermalfe: -849.272659 hartree
dipole: -1.6541 -1.0225 -0.1901
dipole: 1.9538
quadrupole: -116.0694 -118.5961 -117.4827
quadrupole: -4.2770 3.6322 1.5778
quadrupole: 1.3133 -1.2134 -0.1000 -4.2770 3.6322 1.5778
hfenergy: -849.5896986 hartree
pointgroup: C01[X(C18H24O2)]
dipole: -0.6429084 0.3888045 -0.1624751 debye
polarizability: 223.1867609|-14.0936203|197.8226261|-4.8723236|-17.298898|172.2420615 unknown
InChI: InChI=1S/C18H24O2/c1-5-18(4,13-9-10-15(2)3)20-17(19)14-16-11-7-6-8-12-16/h5-8,10-12H,1,9,13-14H2,2-4H3
charge 0 multiplicity 1
44 atoms
O  -0.254178 -0.474721 1.252107
O  1.646324 -1.637133 1.999992
C  -1.159993 -1.712001 1.126546
C  -2.515342 -1.092906 0.712348
C  -2.484838 -0.18769 -0.549131
C  -1.272393 -2.383569 2.516487
C  -0.541488 -2.670755 0.116222
C  -3.874668 0.283406 -0.926584
C  1.064397 -0.572982 1.678553
C  -4.363841 1.557806 -0.924032
C  1.721951 0.807836 1.685217
C  -1.211268 -3.353543 -0.843486
C  2.720777 0.965135 0.53686
C  -3.565379 2.789008 -0.531296
C  -5.800538 1.842308 -1.336297
C  3.871963 0.138908 0.464247
C  2.510291 1.941089 -0.468288
C  4.796147 0.292188 -0.592373
C  3.436587 2.096302 -1.525727
C  4.583314 1.272716 -1.590056
H  -3.2350 -1.922277 0.56408
H  -2.894267 -0.500176 1.566262
H  -2.048224 -0.758249 -1.392187
H  -1.80231 0.656891 -0.359099
H  -1.554146 -1.633705 3.277975
H  -2.060101 -3.15695 2.479046
H  -0.324668 -2.85871 2.81208
H  0.531901 -2.8498 0.256214
H  -4.566819 -0.519532 -1.231049
H  2.247351 0.905229 2.653515
H  0.942365 1.583352 1.628233
H  -2.286572 -3.23536 -1.01904
H  -0.688685 -4.070253 -1.48676
H  -4.068509 3.331172 0.294159
H  -2.539415 2.55247 -0.206531
H  -3.500187 3.498349 -1.380572
H  -5.837141 2.536297 -2.199928
H  -6.361425 2.331617 -0.514679
H  -6.337959 0.919491 -1.616449
H  4.030541 -0.62964 1.229331
H  1.620367 2.5807 -0.424029
H  5.681931 -0.351569 -0.637524
H  3.262085 2.856537 -2.295557
H  5.302363 1.392318 -2.408296
