program: Gaussian 09
title: 000251502
version: EM64L-G09RevD.01
frameworkgroup: C1[X(C9H7NO4)]
method: RPBEPBE
basis: SDD
operation: Freq
keyword: #pfreq=noraman
keyword: PBEPBE/SDD
title: #p freq=noraman PBEPBE/SDD
converged: YES YES NO NO
title: Mulliken charges:
elementType: O O O O N C C C C C C C C C H H H H H H H
charge: -0.250022 -0.193183 -0.207435 -0.173098 0.140904 -0.172166 0.301794 0.061255 -0.382351 0.116495 -0.381997 -0.351598 -0.208032 -0.214186 0.292381 0.282940 0.302222 0.281903 0.272320 0.240190 0.241664
chargesum: 0.00000
title: Mulliken charges with hydrogens summed into heavy atoms:
elementType: O O O O N C C C C C C C C C
charge: -0.250022 -0.193183 -0.207435 -0.173098 0.140904 0.120215 0.301794 0.061255 0.202812 0.116495 -0.100094 -0.079279 0.032158 0.027478
polarizability: 1.38259752e+02 -1.56898335e+00 1.30017902e+02 5.95885739e+00 -4.50241439e+00 6.77986858e+01
1716.lowfreq: -4.8906 0.0004 0.0009 0.0010 4.1764 8.7530 21.8075 59.2615 93.5037
frequency: 21.3243 59.2567 93.4944 124.7929 153.8563 194.8747 252.9724 279.3663 317.9069 415.6987 444.9829 491.5455 532.2653 545.6240 555.4689 581.5656 636.0292 664.8937 694.1313 739.0257 754.5043 791.4422 797.4433 851.7586 900.6987 923.9014 942.9348 974.3608 993.0771 1008.9500 1022.4655 1071.1486 1103.4062 1173.7158 1185.6443 1191.6981 1204.9550 1224.2446 1245.0546 1280.2506 1307.5112 1335.0892 1404.7557 1419.9718 1440.3467 1451.6071 1462.0457 1602.9042 1618.5779 1714.9817 3041.3982 3053.0693 3115.3404 3140.6437 3153.7101 3167.1500 3176.3091
redmass: 9.6197 7.4265 7.6324 3.7412 4.3786 8.1231 5.8645 8.6358 6.0947 3.2609 5.1501 5.5878 4.5059 4.6200 6.5088 4.4487 8.0071 5.1604 7.3099 6.2756 2.9151 1.6258 3.6433 8.2295 1.3184 9.1097 5.4253 1.4713 2.2880 1.3415 2.0592 3.4933 2.0992 1.1101 1.7994 1.3296 1.4575 3.7215 2.2194 1.4649 1.7196 1.6572 7.5120 3.4791 1.2458 2.4562 2.5441 7.4100 7.2698 12.9862 1.0599 1.0844 1.1055 1.0866 1.0908 1.0957 1.1001
irintensity: 1.2585 3.2643 6.6737 6.9344 1.3325 4.0061 4.4615 2.1488 0.9860 0.9779 1.0371 0.5904 0.1615 6.2584 6.8732 16.5027 20.2941 25.5313 7.4160 13.1295 25.7189 46.5109 1.9786 6.0569 0.9470 174.6436 27.1669 7.4929 27.0567 0.3929 0.7116 2.9503 4.9743 5.7936 13.9647 6.5735 12.8259 46.8665 44.2163 14.0980 57.7082 10.8451 2.9108 177.7917 8.5568 12.0925 8.6978 8.0854 12.9533 405.8380 3.9307 2.0204 1.0546 2.1711 4.9413 5.2795 13.8462
temp: 298.150 k
press: 1.00000 atm
elementType: 8 8 8 8 7 6 6 6 6 6 6 6 6 6 1 1 1 1 1 1 1
symmnumber: 1
zpe: 389062.3 jmol-1
zpe.correction: 0.148186 hartree
zpe.thermalcorrener: 0.159563 hartree
zpe.thermalcorrenthalpy: 0.160507 hartree
zpe.thermalcorrgfe: 0.109012 hartree
zpe.sumelectzpe: -701.727648 hartree
zpe.sumelectthermal: -701.716271 hartree
zpe.sumelectthermalent: -701.715326 hartree
zpe.sumelectthermalfe: -701.766822 hartree
dipole: 1.0772 3.2620 0.2530
dipole: 3.4445
quadrupole: -89.5703 -84.2489 -80.7583
quadrupole: 17.1903 2.7183 1.0216
quadrupole: -4.7111 0.6103 4.1009 17.1903 2.7183 1.0216
hfenergy: -701.8758336 hartree
pointgroup: C01 [X(C9H7N1O4)]
dipole: 0.9024311 -1.0102098 -0.040368 debye
dipolederiv: -1.1622377 -0.340495 0.0912697 -0.1673608 -0.6099705 0.0015913 0.1099959 0.0356025 -0.3169624 -0.5869576 -0.2160713 0.0391556 -0.2494468 -1.2250761 0.0735899 0.083475 0.1239731 -0.3272431 -0.4758119 -0.147257 -0.1467406 -0.0004106 -0.4283641 0.2449978 -0.3260774 0.038158 -0.6344501 -0.5648594 -0.1245117 -0.2887494 -0.3039676 -0.4327026 -0.0887032 -0.3200222 0.0089426 -0.5562419 0.7077884 0.2883028 0.452006 0.3672695 0.7463323 -0.2018362 0.6101221 -0.1122399 0.9596959 0.3011284 0.0082292 0.0237239 0.2054604 0.4058563 0.0253619 0.0288723 0.0620148 0.2848729 0.0824326 0.0822409 -0.0216862 -0.2162256 0.0321587 0.002614 -0.0576732 -0.0471838 -0.0896689 -0.1792752 0.1635082 0.0150421 0.1753365 -0.5483431 0.010465 0.0264782 0.0197072 0.0153129 0.2165809 0.0273869 -0.0399072 -0.0134819 -0.0582533 0.0862853 0.0770913 0.1131672 0.0918597 1.4301847 0.3242019 -0.1787663 0.0979544 1.8053123 -0.1072789 -0.261213 -0.2039897 0.2939255 -0.1395237 0.1466536 -0.0275778 0.1900737 -0.0181983 -0.0136796 -0.0264034 -0.0475277 -0.1080597 0.0388194 -0.0681478 -0.0349741 0.1208303 0.1183481 -0.0375394 -0.0362501 -0.0024182 -0.0915798 0.0485462 -0.0157335 -0.0280653 -0.05167 0.1491147 -0.0318952 -0.0261173 -0.0244549 -0.1149878 0.1113829 -0.0875263 -0.0515385 -0.0960638 -0.1827633 0.0141888 -0.0438683 0.022053 -0.1404981 0.0128909 -0.0027175 0.0402497 0.0033052 0.030196 0.0260523 0.0390174 0.016062 0.0016065 0.082141 -0.0522318 0.0389829 -0.0327383 0.064004 -0.0397666 0.0206051 -0.0310266 0.0089866 -0.0472196 0.0116913 -0.0013272 -0.0009268 0.071559 -0.0047756 -0.0085898 -0.0216377 0.1181587 0.0882646 -0.0690092 0.0481553 -0.0647211 0.0410089 0.0026653 0.027983 0.0242422 0.1462704 0.049167 -0.0372876 0.0229274 -0.0777241 0.0347358 0.0259035 0.02904 0.0172613 0.1548712 0.0711586 0.0577406 0.0084215 0.0651839 -0.0729753 0.0139153 0.0096017 0.0118955 0.1502007 -0.0846005 0.0510332 0.0393987 0.0493236 0.0780204 -0.0021559 0.0439327 -0.0026008 0.1539307 unknown
polarizability: 136.0146159|4.4809821|132.4308429|0.6430703|-6.3534682|67.6308813 unknown
InChI: InChI=1S/C9H7NO4/c11-9-7-4-2-1-3-6(7)8(14-9)5-10(12)13/h1-4,8H,5H2
charge 0 multiplicity 1
21 atoms
O  -0.568802 1.727102 0.324178
O  1.260686 3.108551 -0.165792
O  -2.197725 -2.11912 0.672606
O  -3.342195 -1.83066 -1.279504
N  -2.519016 -1.442641 -0.376856
C  -0.814312 0.259535 0.478258
C  0.550594 -0.380556 0.267634
C  1.489318 0.638849 -0.008307
C  -1.89447 -0.063708 -0.570931
C  0.822104 1.964379 0.017897
C  0.953837 -1.727626 0.328763
C  2.849583 0.355679 -0.245664
C  2.318915 -2.021629 0.087626
C  3.257584 -0.995533 -0.198565
H  -1.204826 0.089485 1.496147
H  -1.500828 -0.041545 -1.599891
H  -2.722097 0.662357 -0.495881
H  0.24021 -2.522513 0.562851
H  3.554968 1.166651 -0.45312
H  2.657941 -3.062461 0.128879
H  4.305832 -1.256796 -0.377027
