program: Gaussian 09
title: 000251525
version: EM64L-G09RevD.01
frameworkgroup: C1[X(C20H28O2)]
method: RPBEPBE
basis: SDD
operation: Freq
keyword: #pfreq=noraman
keyword: PBEPBE/SDD
title: #p freq=noraman PBEPBE/SDD
converged: YES YES NO NO
title: Mulliken charges:
elementType: O O C C C C C C C C C C C C C C C C C C C C H H H H H H H H H H H H H H H H H H H H H H H H H H H H
charge: -0.448448 -0.233383 -0.144376 0.415282 -0.154173 -0.074785 0.190100 -0.525659 -0.535241 -0.198590 -0.554884 -0.476523 -0.457404 0.570581 -0.818288 -0.641996 -0.683398 -0.795899 -0.589694 0.514991 -0.023711 -0.749808 0.217980 0.240359 0.194225 0.192244 0.228196 0.218530 0.223882 0.202575 0.213390 0.230189 0.225917 0.216326 0.227864 0.201329 0.256907 0.213258 0.223502 0.223691 0.236233 0.231892 0.225049 0.228079 0.243389 0.218094 0.252833 0.338315 0.226330 0.264728
chargesum: 0.00000
title: Mulliken charges with hydrogens summed into heavy atoms:
elementType: O O C C C C C C C C C C C C C C C C C C C C
charge: -0.110132 -0.233383 0.073604 0.415282 0.086186 0.119439 0.190100 -0.105219 -0.092829 0.003985 -0.111305 -0.034279 -0.028212 0.570581 -0.124621 -0.182071 -0.226457 -0.106337 -0.336861 0.514991 -0.023711 -0.258750
polarizability: 2.89891920e+02 -1.30752318e+01 2.07126991e+02 -6.51941394e+00 -3.12013560e+00 1.54294756e+02
1716.lowfreq: -7.4605 -0.0008 -0.0005 -0.0001 11.6234 18.1708 36.6443 44.9577 80.4183
frequency: 36.3144 44.9115 80.3227 96.7192 118.2822 123.1817 146.1873 181.8578 194.1830 204.6391 209.9478 225.0294 248.9776 257.1161 258.8958 267.7166 289.9232 295.0640 300.3552 326.4703 353.5680 360.7782 371.8471 390.4454 404.7413 429.1492 437.5738 453.8125 486.7743 522.8464 537.1879 547.0992 562.2658 589.4906 616.5652 640.8458 659.1472 688.3618 710.8091 734.2304 765.4864 781.8304 810.6765 830.0026 836.7925 850.8319 875.3685 896.0318 912.0797 914.3577 930.6600 938.9750 951.4948 960.5070 968.5221 984.5330 987.8336 989.9050 1004.9580 1023.4386 1029.1004 1038.6029 1043.8696 1072.3121 1079.0124 1094.2975 1111.6584 1117.9240 1131.1948 1137.9518 1142.0872 1162.2696 1170.4017 1180.5208 1189.8503 1198.7555 1210.4354 1214.4686 1218.7517 1236.1795 1240.8161 1248.3090 1263.6095 1277.2464 1284.9836 1292.4829 1299.8262 1306.6085 1315.3407 1321.5273 1322.8655 1326.1751 1337.5238 1338.4607 1347.5991 1349.1899 1354.7385 1371.9880 1383.0047 1390.1851 1397.1357 1416.1563 1453.3969 1456.2170 1459.2868 1465.9991 1467.3193 1470.6324 1478.5413 1479.8075 1483.3793 1490.9595 1493.4554 1552.3442 1620.1624 1653.2313 2905.2910 2913.1732 2926.8027 2949.2021 2950.7790 2957.8107 2959.4191 2969.8113 2985.0649 2990.1941 2992.9709 2996.8627 3007.5498 3031.3215 3033.5823 3038.3118 3043.5196 3047.1950 3049.8419 3070.8497 3081.1699 3083.2890 3084.8374 3092.0318 3095.3471 3120.9655 3202.7652 3572.4643
redmass: 5.5105 3.6551 3.9942 3.3650 3.3705 2.6768 2.1381 2.4660 2.5453 2.7358 1.2945 1.6912 1.9457 1.8798 1.6195 2.3228 2.7860 2.8618 2.9816 3.6430 3.3288 2.3482 2.3858 2.9574 4.0804 3.3016 3.7225 3.7132 2.4903 3.0921 2.9477 4.3308 2.4746 2.5826 2.8873 2.9293 2.9644 2.6921 2.4376 2.9316 3.0740 1.7250 2.1097 1.9141 1.6146 2.0522 2.0875 1.8528 1.6365 2.0049 1.9270 1.9591 2.0112 1.8997 1.8066 2.9481 1.5870 1.6648 1.9574 2.4397 1.8171 2.6184 2.1634 2.2074 2.8453 1.7173 2.3863 1.9252 1.8761 1.8586 2.2310 2.3286 1.3112 1.6590 1.7174 2.0540 2.0088 1.3693 1.4131 1.3902 1.4853 1.3919 1.4402 1.4884 1.3837 1.3636 1.6274 1.4004 1.4812 1.9042 1.6743 1.3812 1.3877 1.4796 1.6891 1.6678 1.4310 1.5159 1.3088 1.2019 1.3261 1.1946 1.0909 1.0872 1.0756 1.0827 1.0879 1.0810 1.0850 1.0524 1.0586 1.0752 1.0635 10.1099 7.8723 5.8551 1.0809 1.0803 1.0841 1.0663 1.0661 1.0671 1.0728 1.0681 1.0405 1.0525 1.0591 1.0397 1.0621 1.0959 1.0963 1.0977 1.0992 1.1027 1.0960 1.1041 1.0992 1.0994 1.0979 1.0610 1.0992 1.0910 1.1149 1.0663
irintensity: 2.0450 2.0207 0.8527 0.2280 1.1623 0.6815 0.5161 0.9912 4.7753 0.2826 2.0290 1.2536 15.0969 44.0480 67.0812 0.7657 12.9231 1.7770 0.9951 2.6883 3.5721 2.5267 2.8398 2.6733 1.9201 0.1302 0.5461 1.0345 0.9019 3.8778 0.3707 2.5130 2.2508 4.4110 2.2911 1.1495 7.2658 2.9761 3.1492 4.0142 3.6485 0.4953 0.3476 5.1178 7.4268 4.0229 5.4971 9.2143 16.3413 8.0409 4.7333 33.9840 2.8752 4.1122 1.7161 56.5712 49.9749 31.1621 11.7567 14.0916 7.3663 18.5784 9.6826 9.3526 3.7017 3.3511 1.7746 3.1982 8.6593 2.2581 6.3877 4.4293 34.5375 5.1969 13.9064 18.2622 3.5756 6.0153 3.6437 10.6700 9.2374 5.9935 2.0283 10.3358 1.3738 5.1260 43.8993 13.6742 4.7525 34.7018 12.2683 2.8148 3.4352 1.7431 5.2505 4.3739 7.6696 2.9964 11.6752 16.3251 19.8692 28.9268 8.1155 22.9592 6.0476 8.1507 8.2789 8.9729 2.4307 6.9287 3.9307 9.8941 8.2697 140.6637 158.5724 12.4196 0.9941 13.8269 55.3468 8.6590 27.0259 22.5614 30.0438 55.5749 14.6754 18.5505 30.2744 34.2727 46.1342 34.9859 41.8488 25.1607 64.6532 6.1463 25.3693 69.7724 36.6619 19.4556 33.3153 9.0745 19.8813 11.0634 3.9643 3.7213
temp: 298.150 k
press: 1.00000 atm
elementType: 8 8 6 6 6 6 6 6 6 6 6 6 6 6 6 6 6 6 6 6 6 6 1 1 1 1 1 1 1 1 1 1 1 1 1 1 1 1 1 1 1 1 1 1 1 1 1 1 1 1
symmnumber: 1
zpe: 1141001.1 jmol-1
zpe.correction: 0.434584 hartree
zpe.thermalcorrener: 0.455254 hartree
zpe.thermalcorrenthalpy: 0.456198 hartree
zpe.thermalcorrgfe: 0.387377 hartree
zpe.sumelectzpe: -927.666873 hartree
zpe.sumelectthermal: -927.646203 hartree
zpe.sumelectthermalent: -927.645259 hartree
zpe.sumelectthermalfe: -927.714080 hartree
dipole: -5.6353 0.4249 0.1185
dipole: 5.6525
quadrupole: -163.6686 -129.8374 -132.2623
quadrupole: -12.3204 13.4987 1.6942
quadrupole: -21.7458 12.0853 9.6605 -12.3204 13.4987 1.6942
hfenergy: -928.1014569 hartree
pointgroup: C01 [X(C20H28O2)]
dipole: -2.2169038 0.1726953 0.0339207 debye
polarizability: 289.8991148|-13.2389252|207.2261259|-5.7644134|-2.9117687|154.1884266 unknown
InChI: InChI=1S/C20H28O2/c1-12-11-20(3)13(10-17(12)21)4-5-14-15-6-7-18(22)19(15,2)9-8-16(14)20/h10,14-16,18,22H,1,4-9,11H2,2-3H3
charge 0 multiplicity 1
50 atoms
O  -5.339924 -1.389232 -0.346968
O  5.572561 0.560774 -0.651417
C  -2.292503 0.725916 -0.339506
C  -2.996775 -0.627314 -0.013342
C  -0.902046 0.864559 0.312949
C  -0.000294 -0.312519 -0.185725
C  1.478931 -0.2634 0.381047
C  -2.116475 -1.770515 -0.56776
C  -0.678665 -1.69947 0.014686
C  -4.336235 -0.398936 -0.761196
C  -3.378938 1.800945 -0.062207
C  -0.246661 2.219017 -0.035905
C  -4.723632 1.082023 -0.432546
C  2.05856 1.148732 0.181368
C  -3.281297 -0.834073 1.497641
C  1.176732 2.324552 0.557931
C  2.342122 -1.30132 -0.409229
C  1.540794 -0.591471 1.906128
C  3.348734 1.361159 -0.23627
C  3.840893 -1.119097 -0.26561
C  4.348114 0.290431 -0.423551
C  4.719409 -2.132811 -0.043073
H  -2.116551 0.723088 -1.44137
H  -1.013333 0.807744 1.416804
H  0.098099 -0.158697 -1.286789
H  -2.067661 -1.685093 -1.674263
H  -2.565317 -2.755959 -0.338881
H  -0.71701 -1.947574 1.091954
H  -0.068223 -2.487044 -0.464908
H  -4.15094 -0.499866 -1.855311
H  -3.217179 2.715356 -0.659873
H  -3.370327 2.102251 1.002439
H  -0.865697 3.053656 0.344808
H  -0.198076 2.327698 -1.139343
H  -5.425002 1.084003 0.422334
H  -5.23307 1.570665 -1.283231
H  -3.888835 -1.74513 1.630466
H  -2.352372 -0.944968 2.082404
H  -3.852233 0.005223 1.932171
H  1.086103 2.355959 1.665462
H  1.662148 3.270564 0.255891
H  2.084388 -1.197525 -1.485394
H  2.065117 -2.32761 -0.108887
H  1.187061 -1.618844 2.102371
H  2.581605 -0.521297 2.268874
H  0.92342 0.101854 2.503897
H  3.730992 2.383536 -0.354813
H  -6.170523 -1.242115 -0.864449
H  4.388024 -3.169439 0.088334
H  5.794188 -1.923681 0.002856
