program: Gaussian 09
title: 000251488
version: EM64L-G09RevD.01
frameworkgroup: C1[X(C10H8N2O3)]
method: RPBEPBE
basis: SDD
operation: Freq
keyword: #p
keyword: freq=noraman
keyword: PBEPBE/SDD
title: #p freq=noraman PBEPBE/SDD
converged: NO YES NO NO
title: Mulliken charges:
elementType: O O O N N C C C C C C C C C C H H H H H H H H
charge: -0.264843 -0.432352 -0.261855 -0.409783 -0.706048 0.281113 0.269573 0.180395 -0.592813 -0.382374 0.554726 -0.360595 -0.437108 0.042097 0.135225 0.294973 0.229911 0.328482 0.293047 0.226199 0.315820 0.307664 0.388547
chargesum: 0.00000
title: Mulliken charges with hydrogens summed into heavy atoms:
elementType: O O O N N C C C C C C C C C C
charge: -0.264843 -0.043805 -0.261855 -0.081301 -0.082564 0.281113 0.269573 0.180395 -0.297840 -0.152462 0.554726 -0.067549 -0.210909 0.042097 0.135225
polarizability: 2.29541567e+02 -1.27386298e+01 1.57800900e+02 -2.40721354e-02 2.85651887e-02 5.25715234e+01
1716.lowfreq: -3.6550 -0.0009 -0.0003 0.0007 4.8956 6.7378 37.4504 70.9780 125.5427
frequency: 37.4427 70.9758 125.5419 175.3601 181.6799 189.2438 249.1544 324.1462 345.0631 365.2624 377.0507 394.1953 400.5302 406.9819 435.4249 481.0070 498.6852 578.8740 583.2596 587.2021 599.6768 644.6767 664.6852 723.7900 725.2459 752.6411 776.7459 815.8441 839.4314 899.6919 915.8777 921.3533 937.0422 947.4791 970.6452 1047.7971 1066.5950 1150.2602 1163.6509 1246.2003 1270.5923 1278.8232 1296.9935 1320.5541 1363.2740 1409.1380 1419.8750 1454.1221 1502.7524 1541.0288 1585.1473 1626.0399 1630.4332 1642.4999 1654.1466 3120.9362 3144.1068 3170.2564 3205.8589 3507.7718 3532.9354 3566.3713 3706.8661
redmass: 11.7730 5.6230 6.2319 6.1840 4.1250 5.2333 7.1064 7.3867 1.1315 4.1437 8.4257 2.5290 4.8833 1.3925 7.1262 2.9749 4.7726 2.0222 5.8525 5.9295 1.4819 5.4451 2.3659 5.7360 2.7732 2.4079 4.4433 1.5937 5.5421 5.8212 1.5659 1.4918 1.3504 4.5864 3.3907 1.4739 2.4339 1.4515 1.6080 1.7666 2.1686 2.2279 1.7570 3.1495 2.2877 4.2320 4.2632 4.5556 3.8179 7.3644 5.9085 6.6937 4.9843 1.3536 4.3433 1.0869 1.0973 1.0919 1.0922 1.0765 1.0642 1.0450 1.1041
irintensity: 1.7261 0.3723 0.2695 4.2169 0.1434 12.2265 1.9282 0.8237 142.9745 0.7730 3.5807 39.6002 7.1881 139.2770 1.6952 0.3494 0.6064 35.2296 12.7104 61.1638 156.3075 23.2490 3.4423 5.0719 0.2570 52.8236 12.0644 81.0470 3.9357 23.7012 27.2314 24.2582 4.8678 7.0814 48.2496 5.4680 338.6522 75.7855 1.1280 7.7171 16.0367 6.8687 37.8276 86.3104 1.1786 50.2749 8.5306 51.3611 85.6946 12.2490 60.2581 705.4774 85.3349 223.7253 23.0773 10.6261 20.2116 16.3991 6.1260 36.1574 55.4104 104.5405 23.1638
temp: 298.150 k
press: 1.00000 atm
elementType: 8 8 8 7 7 6 6 6 6 6 6 6 6 6 6 1 1 1 1 1 1 1 1
symmnumber: 1
zpe: 440028.0 jmol-1
zpe.correction: 0.167598 hartree
zpe.thermalcorrener: 0.180087 hartree
zpe.thermalcorrenthalpy: 0.181031 hartree
zpe.thermalcorrgfe: 0.128659 hartree
zpe.sumelectzpe: -720.027042 hartree
zpe.sumelectthermal: -720.014553 hartree
zpe.sumelectthermalent: -720.013609 hartree
zpe.sumelectthermalfe: -720.065981 hartree
dipole: -5.8111 1.5165 -0.0356
dipole: 6.0058
quadrupole: -77.7259 -79.1009 -89.9784
quadrupole: 15.8760 0.1738 -0.0922
quadrupole: 4.5425 3.1675 -7.7100 15.8760 0.1738 -0.0922
hfenergy: -720.1946397 hartree
pointgroup: C01 [X(C10H8N2O3)]
dipole: -2.2789564 -0.6153282 -0.1042857 debye
dipolederiv: -1.1914155 -0.3619806 -0.0357088 -0.8190018 -0.8077889 -0.0343716 -0.0226701 -0.0075259 -0.3836083 -1.2068607 0.5445483 -0.074566 0.440836 -0.4952087 0.0339971 -0.0716688 0.0430266 -0.4252107 -0.6720088 -0.0286398 -0.0251089 -0.1105825 -0.9388269 0.0113967 -0.0220471 0.0186322 -0.3226456 -0.630899 -0.5234101 -0.0038005 0.2531876 -0.3099115 0.0172123 -0.0319688 -0.0305003 -0.2684823 -1.3731867 -0.57202 -0.0217851 -0.9283479 -0.4538389 -0.0684867 -0.0191974 -0.0501864 -0.7471102 -0.0467925 0.1007598 -0.0082717 0.4456954 -0.0352947 0.029807 -0.0213135 0.0076895 0.0284866 0.0898024 0.4557853 -0.01519 -0.0603617 0.0956252 -0.0050947 0.0037239 0.026674 0.0589443 0.5297282 -0.1647943 0.036909 0.2007518 -0.489026 0.0299806 0.0248102 0.0086329 0.0090894 -0.3881426 -0.3392018 0.001271 0.1536439 0.001579 0.0015446 -0.0151016 -0.0274142 -0.2157956 0.280275 -0.2972726 0.0382329 0.0462786 0.0966683 -0.0064964 0.0256843 -0.0272054 -0.1631992 1.2399321 0.7639194 0.0421687 1.2274625 0.2925866 0.0705018 0.0262783 0.0416103 0.1381491 -0.2873879 0.1519954 -0.0174997 -0.6942144 -0.1136781 -0.042017 0.0128949 0.0109088 -0.0876295 -0.1879434 0.0649014 -0.0020975 -0.7277142 0.0149401 -0.0521434 0.027129 -0.0039818 -0.1891237 1.2972115 0.5842623 0.0479797 0.9628155 0.7825501 0.0365349 0.0370897 0.013548 0.1694727 1.4651639 -0.3779251 0.1020226 -0.3961095 1.6170976 -0.0724224 0.1019995 -0.0749996 0.2476391 0.144358 -0.0507713 -0.0000484 -0.0912704 0.0470925 -0.0008021 0.0011834 0.0013784 0.1740113 0.0853575 -0.0342859 -0.003544 0.0229837 -0.1088762 0.0112742 -0.0054622 0.0077413 0.1637353 0.1314977 0.0244534 -0.0119251 -0.0080164 0.1801052 0.0042964 -0.0107385 0.0060886 0.312491 0.0737148 0.039417 -0.0069208 -0.0279056 0.111586 0.000217 -0.0045828 0.0040856 0.1634779 -0.1171249 0.0764311 -0.0198573 0.0506507 0.0593002 0.0068011 -0.0193127 0.0084929 0.1611191 0.1606459 0.0500966 -0.0152309 0.1018933 0.167123 0.0150636 -0.0139235 0.0142046 0.3870817 0.2466334 0.0349214 -0.0085003 0.0185148 0.129717 0.0096976 -0.002526 0.0121163 0.3887787 0.3574415 -0.1411899 0.001471 -0.0611894 0.1564794 0.0035097 -0.0002802 -0.0030165 0.4003289 unknown
polarizability: 228.7044945|13.5513055|157.8890582|10.400113|-2.9494057|53.3204368 unknown
InChI: InChI=1S/C10H8N2O3/c11-5-1-2-8-6(3-5)7(10(14)15)4-9(13)12-8/h1-4,12,14H,11H2
charge 0 multiplicity 1
23 atoms
O  3.019533 2.403771 0.177473
O  2.601428 -2.489438 0.339641
O  0.373905 -3.075621 0.200713
N  0.705333 2.088761 0.044312
N  -3.97223 -1.061447 -0.128202
C  -0.3454 -0.13162 0.061027
C  -0.451959 1.301918 0.002352
C  1.009626 -0.687512 0.164955
C  -1.537852 -0.904182 0.01697
C  -1.727833 1.914975 -0.097211
C  -2.809513 -0.291194 -0.083068
C  2.117872 0.147079 0.202878
C  -2.890023 1.136646 -0.139762
C  2.026508 1.607495 0.142023
C  1.240366 -2.165669 0.232216
H  -1.455662 -1.992792 0.060371
H  -1.801231 3.008223 -0.140852
H  0.615415 3.109218 0.002447
H  3.124997 -0.265756 0.281071
H  -3.868993 1.624423 -0.217675
H  -3.923702 -2.075186 -0.083334
H  -4.887221 -0.625497 -0.190854
H  2.68704 -3.4796 0.37721
