program: Gaussian 09
title: 000251476
version: EM64L-G09RevD.01
frameworkgroup: C1[X(C7H16N2)]
method: RPBEPBE
basis: SDD
operation: Freq
keyword: #pfreq=noraman
keyword: PBEPBE/SDD
title: #p freq=noraman PBEPBE/SDD
converged: YES YES NO NO
title: Mulliken charges:
elementType: N N C C C C C C C H H H H H H H H H H H H H H H H
charge: -0.076000 -0.073577 -0.417733 -0.373487 -0.344216 -0.380648 -0.317438 -0.628777 -0.624290 0.222436 0.202406 0.211546 0.181457 0.189299 0.197602 0.204278 0.199701 0.180219 0.187906 0.221359 0.221606 0.188501 0.220365 0.219325 0.188158
chargesum: 0.00000
title: Mulliken charges with hydrogens summed into heavy atoms:
elementType: N N C C C C C C C
charge: -0.076000 -0.073577 0.007109 0.019517 0.042685 0.023331 0.050687 0.002690 0.003558
polarizability: 1.01859582e+02 1.08953909e+00 8.95409533e+01 1.38780618e-01 -6.70095571e-01 7.35078436e+01
1716.lowfreq: -15.1929 -3.0235 -0.0007 -0.0005 -0.0003 25.8349 75.1565 112.2522 188.4073
frequency: 75.0830 112.1634 188.3583 216.5503 226.0072 245.0727 290.8655 313.9355 319.6017 361.7462 401.8906 421.7699 529.5692 550.5511 690.0615 759.3175 843.7296 890.6219 913.7130 950.1646 988.5064 1020.3543 1045.7441 1071.3492 1087.3239 1098.7911 1115.7413 1118.5981 1140.9242 1147.5557 1193.5767 1202.6041 1246.4716 1250.5377 1279.1078 1303.4503 1323.4260 1345.8983 1353.0657 1357.9590 1373.5142 1378.5029 1428.1161 1432.1730 1449.6996 1455.9506 1461.0286 1463.3848 1469.5546 1473.3133 1481.6233 1483.4307 1490.6731 2819.0121 2844.1560 2844.9405 2853.9276 2877.2411 2913.0087 2971.4431 2988.9616 2990.8266 3005.6911 3011.1735 3020.4912 3028.8965 3050.8708 3068.5181 3070.3896
redmass: 2.6830 2.2157 1.8807 1.2703 1.2499 1.7544 2.1020 3.2630 2.5195 1.9795 2.0658 2.6392 2.1919 2.1627 2.8248 3.0302 1.7081 1.8846 2.3309 2.1804 2.0484 1.7462 1.8937 1.8624 1.9503 1.7366 1.4404 1.7235 2.1872 1.9837 1.4197 1.4452 1.3648 2.3558 1.8323 1.3865 1.3404 1.2560 1.4293 1.3480 1.3662 1.3885 1.1612 1.1574 1.0810 1.0963 1.0549 1.0502 1.0790 1.1048 1.0742 1.0554 1.0840 1.0714 1.0591 1.0624 1.0640 1.0686 1.0681 1.0863 1.0636 1.0893 1.0719 1.0720 1.0877 1.0913 1.1005 1.0998 1.1006
irintensity: 1.7594 0.5515 2.6990 0.3223 0.4315 0.8592 10.9107 1.2735 4.6593 1.8371 0.7051 0.0818 1.8079 1.3416 1.4863 13.6048 0.3434 0.9700 3.8163 10.3418 2.6573 8.8614 20.1357 28.0743 27.8077 11.1011 3.4914 11.8936 23.0013 18.1503 4.9277 3.6103 2.9250 23.7416 4.1436 12.5072 18.3523 0.1047 6.2324 3.5852 8.5226 2.3757 0.6942 1.8096 2.1315 9.8952 34.6177 13.5531 3.8918 17.8477 15.5691 7.0567 6.6834 99.6860 248.1391 10.0804 112.5350 133.1018 92.7816 38.5904 35.9434 55.4865 49.8330 51.5415 69.2564 31.9055 42.4968 35.5187 50.9293
temp: 298.150 k
press: 1.00000 atm
elementType: 7 7 6 6 6 6 6 6 6 1 1 1 1 1 1 1 1 1 1 1 1 1 1 1 1
symmnumber: 1
zpe: 593301.5 jmol-1
zpe.correction: 0.225977 hartree
zpe.thermalcorrener: 0.235900 hartree
zpe.thermalcorrenthalpy: 0.236845 hartree
zpe.thermalcorrgfe: 0.191599 hartree
zpe.sumelectzpe: -385.041451 hartree
zpe.sumelectthermal: -385.031527 hartree
zpe.sumelectthermalent: -385.030583 hartree
zpe.sumelectthermalfe: -385.075828 hartree
dipole: 0.4350 -0.0902 -0.1543
dipole: 0.4703
quadrupole: -54.9372 -54.2741 -59.8952
quadrupole: -0.1723 1.5520 -0.9906
quadrupole: 1.4316 2.0947 -3.5264 -0.1723 1.5520 -0.9906
hfenergy: -385.2674274 hartree
pointgroup: C01 [X(C7H16N2)]
dipole: 0.1729316 0.0310932 0.0579656 debye
dipolederiv: -0.7581913 0.0012677 0.0419011 0.0640297 -0.5753013 -0.0173047 -0.055548 -0.0461033 -0.4709654 -0.6352999 0.0293217 0.0775846 0.0312751 -0.5357013 -0.0451034 0.020174 -0.0379206 -0.5455209 0.0002296 0.0212769 0.0081656 0.0292995 0.0573817 -0.0547231 0.0254705 -0.0362692 0.063981 0.1599317 -0.0548039 -0.105537 -0.057173 0.5600103 0.0908251 -0.1374299 0.0692569 0.3469909 0.1716744 -0.0990996 0.0901481 -0.1193082 0.4072437 -0.0581249 0.0944109 -0.0638116 0.3522327 0.2974651 -0.2014993 0.0982536 -0.2304854 0.2581178 -0.0565066 0.0690963 -0.0673128 0.3547624 0.2119587 0.2094706 0.0499308 0.2457674 0.3986259 0.0392133 0.0560613 0.0524488 0.3444638 0.6140572 0.1013165 -0.0655198 0.108474 0.1040229 0.0167572 -0.0523794 0.0489047 0.3092117 0.4450749 -0.0827287 -0.0931304 -0.0994372 0.11983 0.0717142 -0.1087113 0.0915325 0.3861991 0.0213033 -0.0158471 -0.0364195 -0.0070682 0.105685 0.0751223 -0.03226 0.0114086 -0.1277993 0.0230139 0.0135047 0.0019208 0.0031843 -0.2148841 -0.0040512 0.0050567 0.0446544 0.0936575 0.00999 0.0615083 -0.0620159 0.0424662 -0.0623347 0.0725865 -0.1029817 0.1170097 -0.1067884 -0.1241769 0.1152266 0.1536869 0.002219 -0.0735503 -0.0366398 0.1694235 -0.1647785 -0.1431884 -0.1398325 -0.1366878 0.0222561 -0.103 -0.0568083 0.0229061 -0.0083993 0.0026627 0.0668675 0.0201678 0.078214 -0.0858055 0.0450854 -0.017184 -0.0725747 -0.084049 0.0684029 -0.2302378 -0.0060535 0.0614494 -0.0319 0.0726437 0.0347393 -0.1161166 -0.0528093 0.0023458 -0.2274498 -0.0268186 -0.104951 0.0146966 -0.0799 -0.1403762 0.0325246 -0.0162547 -0.0174348 0.0834443 -0.0101448 -0.0689901 0.0027294 -0.076706 -0.0387133 -0.0268328 -0.0501473 -0.17997 -0.222484 -0.035351 0.1098723 -0.0601392 0.0638662 -0.1341699 0.0861582 -0.0678876 0.1157784 0.0111659 -0.0212069 0.0376223 -0.0634221 0.1225222 0.0183329 0.1343893 -0.0964431 0.1004098 -0.0459098 0.0549609 0.0034592 0.008198 -0.0814463 -0.1605463 -0.098517 0.0142463 -0.0704875 0.0699929 -0.2153398 -0.0587636 0.0812284 0.000612 0.0550884 -0.0409718 0.267333 0.0064015 -0.1655999 -0.0565802 -0.0963321 -0.0059215 -0.1939333 -0.0573972 -0.0351921 0.0046579 -0.0474673 0.0736872 0.0413347 0.0655904 -0.0130582 0.1557601 -0.0952468 0.0913161 -0.0413158 0.1075316 0.0144338 -0.0421669 0.0106024 -0.0278309 0.061253 0.0431359 -0.0708544 0.180686 -0.1071928 -0.2851469 unknown
polarizability: 101.7918731|-1.3598434|89.6069021|-0.676551|-0.4542356|73.509604 unknown
InChI: InChI=1S/C7H16N2/c1-8-4-3-5-9(2)7-6-8/h3-7H2,1-2H3
charge 0 multiplicity 1
25 atoms
N  1.509995 0.208898 0.205078
N  -1.650132 0.172191 -0.190011
C  -0.005775 -1.717372 -0.442582
C  1.421862 -1.235281 -0.100966
C  -1.138665 -1.093144 0.403829
C  0.683067 1.102647 -0.639109
C  -0.730954 1.326701 -0.061143
C  2.904204 0.642989 0.392021
C  -2.995572 0.517428 0.315464
H  -0.245791 -1.512025 -1.502259
H  -0.018881 -2.818164 -0.320543
H  1.796302 -1.781108 0.789786
H  2.096587 -1.519314 -0.952729
H  -1.992296 -1.797319 0.425656
H  -0.796015 -0.953272 1.459474
H  0.606416 0.754989 -1.695716
H  1.176249 2.092987 -0.666239
H  -0.599575 1.633147 1.008912
H  -1.199797 2.176897 -0.598535
H  3.387017 0.01213 1.162311
H  2.934251 1.688473 0.747276
H  3.528584 0.57207 -0.536037
H  -3.691107 -0.321209 0.131059
H  -3.378815 1.403443 -0.22341
H  -3.017664 0.750214 1.411115
