program: Gaussian 09
title: 000251472
version: EM64L-G09RevD.01
frameworkgroup: C1[X(C13H14O3)]
method: RPBEPBE
basis: SDD
operation: Freq
keyword: #pfreq=noraman
keyword: PBEPBE/SDD
title: #p freq=noraman PBEPBE/SDD
converged: YES YES NO NO
title: Mulliken charges:
elementType: O O O C C C C C C C C C C C C C H H H H H H H H H H H H H H
charge: -0.256848 -0.203097 -0.232700 -0.279243 -0.466584 -0.568088 0.399470 0.112572 0.049390 0.234378 -0.409651 -0.349128 -0.222821 -0.241117 -0.258157 -0.666460 0.274659 0.250823 0.222280 0.236821 0.227532 0.238207 0.280964 0.232680 0.236920 0.226833 0.238335 0.217591 0.249813 0.224625
chargesum: 0.00000
title: Mulliken charges with hydrogens summed into heavy atoms:
elementType: O O O C C C C C C C C C C C C C
charge: -0.256848 -0.203097 -0.232700 -0.004584 0.006519 -0.103735 0.399470 0.112572 0.049390 0.234378 -0.171444 -0.068164 0.009860 -0.004197 0.207011 0.025570
polarizability: 2.08192381e+02 4.06578624e+00 1.42467681e+02 1.99983196e+00 -2.46579898e+00 8.92178269e+01
1716.lowfreq: -17.7586 -12.3112 -0.8516 -0.0004 0.0003 0.0003 16.2922 33.7916 46.0233
frequency: 14.5590 33.6608 45.7375 83.4376 110.1492 145.5089 151.0350 186.8094 217.9743 240.7384 272.0414 300.0203 315.4646 392.9867 420.7627 425.6454 453.5293 482.9338 506.4318 557.5938 563.4881 644.2776 665.2507 694.2942 729.2633 759.8635 777.7591 798.3824 809.8781 835.2561 860.8003 892.4640 904.3658 966.2484 978.8369 1006.2455 1008.4227 1020.3498 1031.4056 1055.3107 1088.9002 1095.9214 1108.0385 1117.3540 1157.7639 1164.0920 1173.5907 1206.4222 1209.9326 1232.0966 1265.1924 1276.6860 1284.6307 1294.8997 1333.5388 1354.3628 1361.4692 1387.4002 1389.0697 1439.8983 1452.6569 1456.2928 1463.0367 1473.0046 1478.0853 1485.0177 1570.5614 1585.5081 1616.1522 1643.3817 2955.8214 2988.8213 2991.3083 3008.8121 3033.2472 3035.2586 3070.8920 3086.3531 3093.1439 3120.3915 3121.7051 3138.2858 3151.7708 3167.3984
redmass: 3.6325 5.0372 3.3337 5.5898 4.3909 3.9510 3.8340 2.4749 1.4246 6.2189 2.1744 5.6125 3.1954 3.8656 3.3268 4.3022 4.2253 3.7965 4.3050 5.0336 4.9867 3.6755 6.2319 3.6159 3.6600 1.8632 1.9012 2.3464 1.6902 3.1932 2.3195 1.4819 2.6619 2.6194 1.3903 1.4102 2.5609 2.8307 2.2737 2.6265 2.1137 2.1705 1.8355 2.3641 1.6921 1.5263 1.0700 2.0486 1.3672 2.5485 1.4486 1.1206 1.5868 1.5323 1.6274 1.3251 1.5539 6.8889 1.2341 2.3867 1.1844 1.0934 1.0442 1.1614 1.9343 1.0515 8.8147 7.3502 6.9617 9.4605 1.0667 1.0811 1.0359 1.0622 1.0596 1.0918 1.1038 1.0974 1.1026 1.1069 1.0872 1.0894 1.0936 1.1001
irintensity: 0.8861 2.6405 1.4876 0.2740 1.3487 1.3800 0.9852 2.9214 2.1035 1.5213 1.5109 7.6529 13.2109 1.8217 6.1037 1.7155 1.8275 6.5716 0.6260 4.0137 21.7380 5.9391 2.3230 2.0320 11.2376 36.4561 33.0816 4.8224 8.0427 3.6952 2.1652 5.9571 75.5854 5.3433 2.4146 5.0933 69.5671 5.0784 1.2575 23.7322 9.0405 45.3920 43.7701 193.6230 23.9084 14.5251 7.3101 0.8903 54.5096 61.4696 4.0426 0.8502 171.5331 38.4493 12.3763 1.2306 29.3597 4.2867 22.1648 20.5540 18.6165 10.4794 14.2913 8.6823 10.9928 12.7394 97.9640 88.0082 36.8864 147.6954 21.0289 2.9090 21.8284 21.3667 26.5015 28.7064 23.1895 36.5525 2.9563 31.0360 5.2490 12.6828 10.2021 28.9043
temp: 298.150 k
press: 1.00000 atm
elementType: 8 8 8 6 6 6 6 6 6 6 6 6 6 6 6 6 1 1 1 1 1 1 1 1 1 1 1 1 1 1
symmnumber: 1
zpe: 630954.5 jmol-1
zpe.correction: 0.240318 hartree
zpe.thermalcorrener: 0.255066 hartree
zpe.thermalcorrenthalpy: 0.256010 hartree
zpe.thermalcorrgfe: 0.196379 hartree
zpe.sumelectzpe: -728.298935 hartree
zpe.sumelectthermal: -728.284187 hartree
zpe.sumelectthermalent: -728.283242 hartree
zpe.sumelectthermalfe: -728.342873 hartree
dipole: 1.5139 2.7456 -1.9834
dipole: 3.7100
quadrupole: -71.0494 -90.5298 -100.2549
quadrupole: 1.7459 4.3709 -1.2125
quadrupole: 16.2287 -3.2518 -12.9769 1.7459 4.3709 -1.2125
hfenergy: -728.5392528 hartree
pointgroup: C01 [X(C13H14O3)]
dipole: 0.5927206 1.1935045 -0.5955905 debye
polarizability: 207.949708|4.41123|142.0778899|4.81405|5.770525|89.8502917 unknown
InChI: InChI=1S/C13H14O3/c1-2-16-13(15)11-8-7-9-5-3-4-6-10(9)12(11)14/h3-6,11H,2,7-8H2,1H3
charge 0 multiplicity 1
30 atoms
O  -3.089631 -0.180667 -0.835983
O  -0.34257 -1.834571 -0.200146
O  -2.642585 0.066434 1.443055
C  -0.890258 0.557368 -0.224413
C  -0.349076 1.75675 0.591844
C  1.035076 2.179572 0.062108
C  2.013925 1.015821 0.011852
C  1.543578 -0.327548 -0.094887
C  0.083647 -0.645681 -0.164586
C  -2.27571 0.130609 0.248084
C  3.410401 1.242147 0.068023
C  2.468812 -1.406589 -0.14438
C  4.324454 0.168144 0.01276
C  3.852717 -1.164516 -0.094433
C  -4.458115 -0.699268 -0.516587
C  -5.448489 0.45496 -0.339623
H  -0.965614 0.840641 -1.294533
H  -0.290117 1.469509 1.657605
H  -1.056965 2.602702 0.520701
H  1.452024 2.992061 0.685498
H  0.918588 2.601145 -0.959293
H  3.78294 2.269429 0.16149
H  2.067829 -2.422549 -0.223129
H  5.401372 0.365724 0.059613
H  4.561712 -1.998159 -0.134783
H  -4.702807 -1.329165 -1.386336
H  -4.390585 -1.317455 0.395348
H  -6.467249 0.051443 -0.19012
H  -5.187102 1.06315 0.542553
H  -5.4630 1.103856 -1.232601
