program: Gaussian 09
title: 000251470
version: EM64L-G09RevD.01
frameworkgroup: C1[X(C10H15NO)]
method: RPBEPBE
basis: SDD
operation: Freq
keyword: #p
keyword: freq=noraman
keyword: PBEPBE/SDD
title: #p freq=noraman PBEPBE/SDD
converged: YES YES NO NO
title: Mulliken charges:
elementType: O N C C C C C C C C C C H H H H H H H H H H H H H H H
charge: -0.273024 -0.028912 -0.523357 -0.259904 0.167721 -0.376106 0.150321 -0.202634 -0.159141 -0.350230 -0.775577 -0.677549 0.236717 0.221696 0.187427 0.222518 0.241496 0.186559 0.182712 0.235466 0.236793 0.200280 0.226643 0.228547 0.240619 0.242899 0.218019
chargesum: 0.00000
title: Mulliken charges with hydrogens summed into heavy atoms:
elementType: O N C C C C C C C C C C
charge: -0.273024 -0.028912 -0.064944 0.150041 0.167721 -0.134609 0.150321 0.166636 0.076325 -0.113438 -0.074040 -0.022078
polarizability: 1.56198711e+02 2.89451851e+00 1.20688921e+02 -9.29483434e+00 3.03848470e+00 7.73651439e+01
1716.lowfreq: -13.7498 -3.9540 -1.7655 0.0005 0.0008 0.0009 21.2179 37.1407 59.1440
frequency: 18.9985 36.9988 59.0859 63.6916 82.5907 124.0812 158.0203 191.4580 236.9575 240.0306 277.3972 341.1462 407.4083 427.7251 455.4628 536.3319 565.0494 619.6030 720.2607 748.8152 786.4974 807.8019 817.8917 847.2397 905.2251 922.6306 955.3744 993.0915 997.4223 1007.3210 1046.2601 1050.5236 1060.7188 1071.6661 1092.5596 1123.2924 1136.4706 1170.0274 1174.0201 1223.4937 1250.8232 1261.9798 1266.5299 1297.9052 1316.4065 1342.7097 1385.1112 1388.2373 1397.2998 1401.2484 1443.9304 1455.7025 1459.3092 1460.5474 1474.3216 1476.1178 1485.3908 1496.8802 1572.3321 1582.3872 2911.5930 2923.5329 2960.1709 2987.0390 2989.8006 2992.9276 3010.5112 3075.9026 3076.8239 3090.6659 3099.5322 3100.0777 3131.5120 3147.5516 3163.6938
redmass: 2.7261 2.2380 1.6218 1.6176 2.4729 2.7276 3.8562 3.0128 3.0204 1.2657 2.9330 3.5360 2.6814 3.4331 3.1628 5.0190 3.9261 4.5813 4.8955 2.0675 1.3974 1.3455 1.1320 2.7045 1.4028 2.3806 4.6947 1.3745 3.2374 1.9956 1.6055 1.8730 2.7360 5.3721 1.5302 2.2602 1.3808 1.1378 1.2609 1.6514 1.1475 1.9539 1.2026 2.9086 2.4981 1.4365 1.4538 1.4447 1.5861 1.5723 2.1964 1.0469 1.0417 1.1014 1.1772 1.0682 1.0638 1.0801 7.1357 5.2593 1.0558 1.0581 1.1063 1.1017 1.0364 1.0357 1.0593 1.0973 1.1032 1.0991 1.1004 1.1009 1.0869 1.0930 1.1006
irintensity: 3.0467 0.4162 0.5706 1.3773 1.8761 4.1485 1.1367 2.9204 5.5591 2.2554 2.0169 8.4961 1.5732 1.0609 1.2891 3.3882 3.8321 3.3057 1.0850 23.1633 23.5407 4.3537 6.7456 9.9944 0.4325 1.1596 2.9336 1.1988 24.9237 5.5157 13.6702 4.6276 1.5236 184.7099 8.5540 25.7846 4.4665 1.8762 6.0094 5.7642 0.2288 4.2202 2.6880 1.5825 4.4966 42.0628 12.7581 9.9603 19.5239 5.1336 55.3453 14.0289 11.1073 12.3007 43.5319 11.5274 0.5674 6.0611 64.1356 43.4738 35.0532 98.3749 66.4337 29.1106 20.1997 27.8517 18.8544 14.3102 22.2467 38.0372 20.9228 39.1151 2.8723 23.8751 19.5541
temp: 298.150 k
press: 1.00000 atm
elementType: 8 7 6 6 6 6 6 6 6 6 6 6 1 1 1 1 1 1 1 1 1 1 1 1 1 1 1
symmnumber: 1
zpe: 600388.7 jmol-1
zpe.correction: 0.228676 hartree
zpe.thermalcorrener: 0.241904 hartree
zpe.thermalcorrenthalpy: 0.242848 hartree
zpe.thermalcorrgfe: 0.186381 hartree
zpe.sumelectzpe: -519.101105 hartree
zpe.sumelectthermal: -519.087877 hartree
zpe.sumelectthermalent: -519.086933 hartree
zpe.sumelectthermalfe: -519.143400 hartree
dipole: 1.3887 -0.3648 -1.7477
dipole: 2.2619
quadrupole: -62.6056 -68.1542 -74.6454
quadrupole: -3.0156 1.9724 0.1088
quadrupole: 5.8628 0.3142 -6.1770 -3.0156 1.9724 0.1088
hfenergy: -519.3297811 hartree
pointgroup: C01[X(C10H15N1O1)]
dipole: -0.579305 0.2368432 -0.6326211 debye
polarizability: 157.0826682|1.2488474|120.7224865|5.0818819|2.1604536|76.4476211 unknown
InChI: InChI=1S/C10H15NO/c1-3-12-8-7-10-6-4-5-9(2)11-10/h4-6H,3,7-8H2,1-2H3
charge 0 multiplicity 1
27 atoms
O  3.026479 0.055545 0.127931
N  -1.258361 -0.698454 0.375948
C  0.774988 0.604002 0.809557
C  1.629283 -0.007998 -0.313893
C  -0.706881 0.550954 0.485331
C  -1.475169 1.728908 0.300982
C  -2.591376 -0.817526 0.083035
C  3.951902 -0.526646 -0.853576
C  -2.849532 1.607615 0.000895
C  -3.418318 0.319423 -0.109836
C  -3.132888 -2.228445 -0.013146
C  5.364274 -0.413556 -0.27956
H  0.973899 0.026272 1.730988
H  1.098644 1.644811 0.986267
H  1.50151 0.559505 -1.263815
H  1.317699 -1.059809 -0.488165
H  -1.001746 2.711466 0.395459
H  3.681167 -1.590174 -1.041225
H  3.869824 0.020429 -1.820348
H  -3.46753 2.500543 -0.143696
H  -4.480999 0.191571 -0.339387
H  6.104613 -0.836269 -0.983275
H  5.619825 0.643842 -0.0927
H  5.43529 -0.959632 0.676804
H  -2.558945 -2.809639 -0.75663
H  -3.019893 -2.749058 0.955143
H  -4.198456 -2.23868 -0.297387
