program: Gaussian 09
title: 000251560
version: EM64L-G09RevD.01
frameworkgroup: C1[X(C24H18N2S2)]
method: RPBEPBE
basis: SDD
operation: Freq
keyword: #p
keyword: freq=noraman
keyword: PBEPBE/SDD
title: #p freq=noraman PBEPBE/SDD
converged: YES YES NO NO
title: Mulliken charges:
elementType: S S N N C C C C C C C C C C C C C C C C C C C C C C C C H H H H H H H H H H H H H H H H H H
charge: 0.313198 0.082589 -0.243794 -0.091278 -0.510119 0.371093 0.643525 0.358048 -0.570543 -0.409053 0.405137 -0.383741 -0.599498 0.372679 -0.430432 -0.274760 -0.350831 -0.319332 -0.281026 -0.422904 -0.409044 -0.247600 -0.244597 -0.227617 -0.239785 -0.242631 -0.244323 -0.260291 0.261144 0.289068 0.282573 0.239526 0.240341 0.272721 0.256084 0.261411 0.248157 0.246026 0.241876 0.237574 0.235237 0.224592 0.230309 0.230747 0.230867 0.228675
chargesum: 0.00000
title: Mulliken charges with hydrogens summed into heavy atoms:
elementType: S S N N C C C C C C C C C C C C C C C C C C C C C C C C
charge: 0.313198 0.082589 -0.243794 -0.091278 0.040094 0.371093 0.643525 0.358048 -0.287970 -0.409053 0.405137 -0.144215 -0.599498 0.372679 -0.190091 -0.002039 -0.094747 -0.057922 -0.032868 -0.176879 -0.167167 -0.010026 -0.009360 -0.003025 -0.009476 -0.011884 -0.013456 -0.031616
polarizability: 4.24617164e+02 -7.07074945e+01 3.13565871e+02 -9.75696030e+00 1.85945726e+01 2.32120204e+02
1716.lowfreq: -7.0532 -4.2693 -0.0015 -0.0007 0.0010 3.2169 9.0956 19.4078 31.4901
frequency: 7.2784 19.3332 31.4856 43.4155 50.7383 67.9762 90.1281 98.0976 132.7652 143.3608 174.1066 187.6145 192.0854 205.3230 241.1803 277.8456 298.8067 321.9019 329.1341 342.6109 380.0758 391.8964 402.1180 406.3236 428.1223 429.3542 477.7159 484.1652 489.2856 507.9600 515.0303 524.8338 531.6671 555.7725 574.4832 598.7247 614.4049 618.0960 644.5251 665.6926 680.7194 690.8751 712.5450 726.2300 756.6739 757.6348 760.2017 761.4464 777.2146 781.6974 796.3960 823.7846 826.8311 852.7057 871.6511 888.3132 895.6050 908.5167 918.6324 936.4470 945.1178 954.0247 967.0388 972.4755 981.0757 984.4266 986.2347 992.9485 1006.2801 1022.3459 1025.4822 1030.6511 1059.9702 1071.2367 1090.6447 1099.6011 1131.1840 1138.1114 1162.4573 1173.0177 1174.4338 1177.1365 1198.8590 1200.3881 1209.5065 1238.4837 1258.5548 1265.9299 1277.4206 1282.4575 1316.2020 1333.6889 1357.5081 1372.2024 1384.8145 1395.7457 1404.4608 1413.7620 1422.4248 1436.9081 1444.7793 1446.7236 1456.1515 1459.9816 1467.7763 1487.4699 1513.7484 1575.3625 1587.6678 1589.0901 1598.5481 1600.8087 1613.3216 1637.2978 3008.4991 3084.0430 3121.7625 3124.7483 3127.3864 3127.7046 3138.1916 3140.9198 3141.3656 3144.5923 3149.8062 3154.3169 3157.0170 3163.4945 3167.8418 3170.9516 3188.6753 3191.3062
redmass: 6.2426 5.0676 5.3461 6.1158 4.0372 5.9437 8.6172 5.7724 5.4372 6.8932 5.4969 4.4915 4.1728 6.7762 7.3728 4.8448 4.1356 6.3408 5.7843 3.0440 12.7980 6.3112 3.2046 2.9108 3.3067 4.2810 2.8213 4.6234 7.2222 5.7022 6.4066 3.9678 4.3725 5.0138 4.3716 6.3509 6.2502 6.4823 7.0713 3.2822 6.3797 2.0772 4.1049 2.8995 1.4562 1.7060 3.6403 1.5923 3.8352 3.7803 4.2166 1.4015 1.2705 1.3656 1.4960 4.7323 1.5918 4.6667 1.5800 1.3942 3.7722 1.3603 1.3718 1.4085 1.3194 3.3466 1.5584 1.3415 6.6995 2.3218 2.6274 2.2622 2.1322 3.3883 4.3202 1.7354 1.7175 1.4958 1.2480 1.0655 1.0770 1.1126 2.1568 1.1681 2.1334 2.1547 1.7831 3.5080 1.7415 1.5051 2.2646 1.7160 1.8486 2.0594 3.7162 3.6416 4.3502 1.4467 4.0090 3.5165 2.2885 2.2941 1.5822 1.6410 2.4053 2.2387 3.6071 7.1405 6.8255 6.3338 6.6635 5.7068 5.9962 6.7680 1.0613 1.1032 1.0861 1.0873 1.0887 1.0851 1.0896 1.0862 1.0920 1.0948 1.0967 1.0916 1.0937 1.1003 1.0985 1.0982 1.0938 1.0951
irintensity: 0.2751 0.7901 0.8473 0.0067 0.1015 0.5132 2.4477 1.8467 1.0494 0.4284 0.2508 2.3882 2.9149 2.9452 1.8876 0.1996 0.5488 3.5383 2.0123 2.4138 2.8671 0.9745 2.6825 2.7880 2.1539 5.7756 7.8229 31.3480 8.7948 1.6775 2.3652 8.0284 25.1510 5.0669 22.0453 6.7120 0.7249 4.8219 10.3692 7.9976 4.2526 17.4591 21.5091 12.0615 58.8480 50.8022 18.7919 67.6008 8.9642 11.8988 11.5188 38.4401 6.1390 3.8173 11.2264 10.2983 2.9347 18.0987 10.4664 2.8037 16.1945 0.7813 2.1482 5.4717 0.3978 1.9821 0.6151 0.1015 127.1115 9.7780 35.1340 0.8850 68.9148 150.2277 73.6151 6.4131 16.0340 23.1626 6.5956 4.4266 1.7191 10.1426 137.1442 16.8404 65.2020 11.9150 36.1135 21.7595 4.9795 36.1353 225.8000 167.8761 4.9466 22.9696 12.1843 1.2898 6.2751 15.6649 1.2108 3.4215 1.9395 4.2005 8.6046 61.5030 41.0277 134.6840 65.3249 2.2777 0.6649 3.6389 16.1137 82.2528 66.8027 47.1954 17.4425 6.4904 3.0383 9.5341 1.2857 2.3376 12.9621 1.6025 5.5579 31.3513 16.4473 10.7174 30.8313 35.5644 16.0064 17.9158 2.8812 6.3564
temp: 298.150 k
press: 1.00000 atm
elementType: 16 16 7 7 6 6 6 6 6 6 6 6 6 6 6 6 6 6 6 6 6 6 6 6 6 6 6 6 1 1 1 1 1 1 1 1 1 1 1 1 1 1 1 1 1 1
symmnumber: 1
zpe: 924211.6 jmol-1
zpe.correction: 0.352014 hartree
zpe.thermalcorrener: 0.374670 hartree
zpe.thermalcorrenthalpy: 0.375614 hartree
zpe.thermalcorrgfe: 0.297043 hartree
zpe.sumelectzpe: -1829.093282 hartree
zpe.sumelectthermal: -1829.070626 hartree
zpe.sumelectthermalent: -1829.069682 hartree
zpe.sumelectthermalfe: -1829.148253 hartree
dipole: 4.9896 -2.6339 -0.7587
dipole: 5.6929
quadrupole: -180.2849 -169.2491 -169.4893
quadrupole: 1.7437 8.8418 0.0101
quadrupole: -7.2772 3.7587 3.5185 1.7437 8.8418 0.0101
hfenergy: -1829.4452961 hartree
pointgroup: C01 [X(C24H18N2S2)]
dipole: -1.8614371 -1.1664857 -0.4369156 debye
polarizability: 400.0768729|81.0212384|337.3721899|29.2824249|14.7939845|232.8541769 unknown
InChI: InChI=1S/C24H18N2S2/c27-24-26(22-12-6-7-13-23(22)28-24)17-25(20-10-2-1-3-11-20)21-15-14-18-8-4-5-9-19(18)16-21/h1-16H,17H2
charge 0 multiplicity 1
46 atoms
S  0.90285 4.869484 0.703908
S  3.178375 3.389747 2.193033
N  1.190384 -0.183133 0.828413
N  0.789139 2.281196 1.26554
C  1.163029 0.911054 1.792727
C  0.113318 -1.139114 0.81459
C  -0.480613 2.581615 0.702345
C  2.339255 -0.381292 -0.014949
C  -0.453779 -1.565266 -0.3961
C  -0.605481 3.942871 0.308735
C  -1.51597 -2.521696 -0.423343
C  -0.391277 -1.676871 2.049565
C  1.661373 3.362242 1.43546
C  -2.03512 -3.044918 0.825834
C  -1.442634 -2.593729 2.050418
C  -1.578059 1.706005 0.541019
C  2.674258 -1.686879 -0.476207
C  3.190665 0.700792 -0.363107
C  -1.785349 4.442354 -0.268649
C  -2.10064 -2.969178 -1.656502
C  -3.108273 -3.99432 0.795557
C  -2.766818 2.20594 -0.033166
C  -2.873869 3.556937 -0.443909
C  3.817289 -1.892759 -1.273666
C  4.341008 0.479686 -1.151606
C  -3.147417 -3.893293 -1.654746
C  -3.655576 -4.412543 -0.419852
C  4.662054 -0.812243 -1.621485
H  0.428182 0.675205 2.579612
H  2.15752 1.065371 2.24846
H  -0.077982 -1.156009 -1.340287
H  0.080536 -1.393338 2.996637
H  -1.810718 -2.999792 3.000061
H  -1.52104 0.660068 0.845569
H  2.049642 -2.541222 -0.199687
H  2.978407 1.715009 -0.019602
H  -1.86336 5.492254 -0.567152
H  -1.711252 -2.573923 -2.602111
H  -3.494399 -4.389887 1.742659
H  -3.618167 1.529327 -0.160683
H  -3.803664 3.922742 -0.891211
H  4.055557 -2.907852 -1.611389
H  4.98306 1.332022 -1.400346
H  -3.585267 -4.228811 -2.601238
H  -4.474936 -5.139311 -0.435165
H  5.551759 -0.976539 -2.238285
