program: Gaussian 09
title: 000002611
version: EM64L-G09RevD.01
frameworkgroup: C1[X(C19H18N3O4S2)]
method: RPBEPBE
basis: SDD
operation: Freq
keyword: #p
keyword: freq=noraman
keyword: PBEPBE/SDD
title: #p freq=noraman PBEPBE/SDD
converged: YES YES NO NO
title: Mulliken charges:
elementType: S S O O O O N N N C C C C C C C C C C C C C C C C C C C H H H H H H H H H H H H H H H H H H
charge: 0.303275 0.250392 -0.106338 -0.465893 -0.138321 -0.247530 -0.201662 -0.377075 -0.056345 -0.471919 -0.178672 0.120584 0.227515 0.374760 -0.826316 -0.579804 0.087727 0.246920 -0.588498 -0.116606 -0.101442 -0.121402 -0.185747 -0.192129 -0.134773 -0.268469 -0.123336 -0.504049 0.331924 0.324930 0.291865 0.261533 0.354261 0.297457 0.257025 0.276400 0.272992 0.286243 0.350557 0.413630 0.282738 0.281524 0.290716 0.270609 0.257806 0.272943
chargesum: 1.00000
title: Mulliken charges with hydrogens summed into heavy atoms:
elementType: S S O O O O N N N C C C C C C C C C C C C C C C C C C C
charge: 0.303275 0.250392 -0.106338 -0.052263 -0.138321 -0.247530 -0.201662 -0.022813 -0.056345 -0.139995 0.146258 0.120584 0.227515 0.374760 -0.272918 -0.025322 0.087727 0.246920 -0.039106 0.169637 0.249115 -0.121402 0.096991 0.089396 0.155943 0.002140 0.134470 -0.231105
polarizability: 3.36403308e+02 -5.03809039e+01 2.43089547e+02 2.05745096e+01 1.62501833e+00 2.55105422e+02
1716.lowfreq: -6.0241 -3.1446 0.0004 0.0007 0.0009 8.8395 14.3227 16.2351 26.0400
frequency: 14.3111 16.1102 25.9463 32.1291 40.7559 42.6836 49.2994 55.8204 63.4133 66.1106 88.4839 122.1338 137.2069 144.5157 168.8720 179.2132 205.1709 210.3904 241.9306 265.8957 279.5524 287.2412 308.7757 333.6345 361.5481 373.7064 378.2195 398.0260 422.4229 444.1402 448.5400 464.0441 499.6299 540.7348 556.3597 561.9991 574.1754 592.1279 595.5017 610.3257 630.6533 640.0905 642.4171 653.1668 664.0333 674.0231 692.1713 705.5980 707.5968 718.1667 726.9059 742.1780 757.5300 799.0692 809.4956 821.2183 843.5069 852.7582 872.7993 874.9142 906.3152 911.7558 919.5232 931.7680 962.0579 966.8861 977.4125 989.2245 1000.3387 1011.6970 1025.4673 1039.9656 1051.3935 1061.5188 1081.4848 1086.9792 1097.0738 1102.2128 1125.5641 1131.0341 1154.9728 1181.5795 1183.9952 1198.2058 1200.1291 1205.5997 1221.3946 1232.7423 1240.2223 1242.7140 1249.3811 1259.2260 1286.0187 1295.1888 1325.7030 1342.0978 1345.4775 1359.7110 1374.9357 1402.9809 1431.0369 1432.6687 1452.8565 1462.0232 1477.1284 1478.0699 1487.8047 1552.1490 1570.9162 1590.4943 1622.4536 1624.0736 1679.7468 1746.0780 2987.8997 3007.2928 3011.3135 3033.3992 3053.3005 3067.3679 3083.7870 3112.1573 3162.2036 3165.9806 3176.2034 3186.7648 3189.2806 3196.5290 3205.2520 3239.5635 3491.1477 3496.4843
redmass: 6.5723 7.3037 6.5641 5.8600 7.9024 5.6224 5.8911 6.7278 6.7096 7.1822 7.2383 4.6382 9.9895 7.1221 5.4138 5.7840 6.1444 6.6182 7.0916 6.8806 2.5631 7.8946 5.2012 5.1018 4.2957 6.2781 5.4239 2.7415 3.5122 4.4439 2.9383 5.8505 4.9379 4.4634 4.1182 3.5375 2.8146 6.0551 6.6643 3.0546 1.2483 3.5686 6.1629 4.9309 2.3165 5.4387 2.5745 3.0093 1.4349 5.8393 4.9814 6.1262 2.2605 2.6599 4.8943 4.2395 1.3782 2.0941 3.4402 1.2806 3.7092 1.8019 1.7643 4.6949 1.5434 2.9376 3.6498 3.9420 1.5658 4.3640 1.3712 1.6957 2.6123 4.0485 1.2407 2.3086 2.2374 2.4220 1.6853 1.4974 1.5677 1.3534 1.0857 1.8493 1.7742 1.3043 1.2056 1.2473 1.9855 1.2719 1.3508 2.1318 2.5119 1.4435 1.4427 2.1887 1.3020 1.9326 1.9327 4.6520 1.1126 1.1144 1.2426 1.9402 6.5784 2.1483 1.6016 6.0044 5.9717 7.4622 7.7999 4.9103 9.8758 12.7613 1.0822 1.0627 1.0606 1.0629 1.0882 1.0978 1.1030 1.1022 1.0959 1.0923 1.0909 1.0930 1.0958 1.0978 1.1026 1.1007 1.0641 1.0783
irintensity: 0.1160 2.1880 1.0053 0.6575 0.1872 0.3703 1.0284 1.9389 4.0894 4.0727 1.8973 1.6992 2.1438 0.4686 1.0271 0.2162 2.8629 5.9017 2.4963 8.6436 1.5759 1.8181 3.3767 1.8231 4.8613 6.9079 11.7849 0.1587 3.2471 22.7754 0.3418 31.0523 12.0427 21.7651 10.5621 4.6834 35.3198 0.6408 6.1168 11.2060 27.7798 24.4457 0.2421 10.1669 80.1654 1.0707 43.8951 1.3214 120.9773 34.8362 4.8479 0.5206 44.1725 48.4188 7.2624 9.7519 11.8358 69.2278 25.3842 4.7042 154.9136 5.6279 2.4755 14.9172 3.6473 67.0921 24.8244 22.8454 2.7895 8.9145 0.4871 12.4989 0.4674 104.4321 12.2608 284.2983 16.9068 111.4109 10.3678 17.2957 18.7492 29.8334 1.6601 49.1365 23.9305 28.1257 7.3466 25.9184 7.8169 16.3457 91.3106 3.6931 55.0159 7.7810 153.9414 0.6132 18.9458 5.5117 20.0633 120.5281 10.9772 99.6906 16.3817 325.3570 16.8577 62.6636 40.0932 4.1350 12.0749 272.9355 215.8495 15.0247 139.3548 430.7500 80.3379 4.6510 16.0934 15.7735 12.6153 0.3787 9.1356 0.7375 44.8372 3.1230 0.4532 1.2636 1.6408 2.5780 0.0345 0.5552 73.1810 90.0962
temp: 298.150 k
press: 1.00000 atm
elementType: 16 16 8 8 8 8 7 7 7 6 6 6 6 6 6 6 6 6 6 6 6 6 6 6 6 6 6 6 1 1 1 1 1 1 1 1 1 1 1 1 1 1 1 1 1 1
symmnumber: 1
zpe: 898304.4 jmol-1
zpe.correction: 0.342146 hartree
zpe.thermalcorrener: 0.368134 hartree
zpe.thermalcorrenthalpy: 0.369078 hartree
zpe.thermalcorrgfe: 0.281004 hartree
zpe.sumelectzpe: -1993.817913 hartree
zpe.sumelectthermal: -1993.791925 hartree
zpe.sumelectthermalent: -1993.790980 hartree
zpe.sumelectthermalfe: -1993.879054 hartree
dipole: -20.5914 8.6788 2.0128
dipole: 22.4361
quadrupole: -25.3415 -161.9023 -163.7565
quadrupole: -23.2793 14.2336 2.2800
quadrupole: 91.6586 -44.9022 -46.7564 -23.2793 14.2336 2.2800
hfenergy: -1994.1600587 hartree
pointgroup: C01 [X(C19H18N3O4S2)]
dipole: -7.7983912 4.1012513 0.5304038 debye
polarizability: 325.7926393|-57.4348239|252.372725|23.1499106|-1.848441|256.4329134 unknown
InChI: InChI=1S/C19H18N3O4S2/c23-14(9-13-5-4-8-27-13)20-15-17(24)22-16(19(25)26)12(11-28-18(15)22)10-21-6-2-1-3-7-21/h1-8,15,18,20,25H,9-11H2
charge 1 multiplicity 1
46 atoms
S  -0.28285 -0.601408 -2.512333
S  5.447477 1.994978 -0.352163
O  0.949161 -2.103422 1.986038
O  -3.17574 -0.882553 2.233535
O  -1.951715 -2.805118 1.743659
O  3.809036 -2.143512 -2.009312
N  -0.276633 -0.826044 0.273328
N  3.045989 -0.876052 -0.218536
N  -4.607078 1.042526 -0.409725
C  0.566372 -0.341688 -0.861278
C  1.696464 -1.330894 -0.385813
C  0.82043 -1.581116 0.878466
C  -1.66185 -0.80846 0.350077
C  -2.430777 -0.220801 -0.644376
C  -1.793094 0.398345 -1.875827
C  -3.936405 -0.319985 -0.637532
C  -2.239636 -1.628926 1.480576
C  4.056005 -1.350186 -1.059127
C  5.482584 -0.869306 -0.731877
C  -5.377218 1.611381 -1.393897
C  -4.414158 1.671967 0.798496
C  5.598816 0.282226 0.230339
C  -5.984703 2.860074 -1.190526
C  -5.008832 2.917703 1.045574
C  -5.801508 3.526117 0.043313
C  5.83301 0.257733 1.60058
C  5.892062 1.5637 2.215006
C  5.703208 2.601275 1.317946
H  0.836771 0.722013 -0.756861
H  1.721075 -2.228496 -1.038073
H  -1.423331 1.424552 -1.699579
H  -2.49677 0.431402 -2.724539
H  3.309041 -0.248652 0.548106
H  -4.315297 -0.9805 0.156659
H  -4.316408 -0.68601 -1.607716
H  6.018113 -1.746268 -0.319998
H  5.966689 -0.65339 -1.700731
H  -5.49015 1.046291 -2.321883
H  -3.798273 1.134239 1.525658
H  -3.496601 -1.436418 2.999057
H  -6.590081 3.294693 -1.989192
H  -4.851912 3.397408 2.014471
H  -6.269121 4.498697 0.22134
H  5.980397 -0.674175 2.154003
H  6.081765 1.723239 3.278777
H  5.714774 3.675324 1.49469
