program: Gaussian 09
title: 000251499
version: EM64L-G09RevD.01
frameworkgroup: C1[X(C13H15FN2O6S)]
method: RPBEPBE
basis: SDD
operation: Freq
keyword: #p
keyword: freq=noraman
keyword: PBEPBE/SDD
title: #p freq=noraman PBEPBE/SDD
converged: YES YES NO NO
title: Mulliken charges:
elementType: S F O O O O O O N N C C C C C C C C C C C C C H H H H H H H H H H H H H H H
charge: 0.157840 -0.164351 -0.296111 -0.279127 -0.260272 -0.236796 -0.218088 -0.175784 -0.178912 -0.408307 -0.065663 -0.054653 -0.509258 0.012598 -0.735773 0.231217 -0.192018 0.306544 0.190860 0.106365 0.003117 -0.755671 -0.704821 0.296405 0.279858 0.304613 0.248267 0.282779 0.311722 0.303586 0.312441 0.368263 0.251984 0.252141 0.252414 0.245275 0.256948 0.260367
chargesum: 0.00000
title: Mulliken charges with hydrogens summed into heavy atoms:
elementType: S F O O O O O O N N C C C C C C C C C C C C C
charge: 0.157840 -0.164351 -0.296111 -0.279127 -0.260272 -0.236796 -0.218088 -0.175784 -0.178912 -0.040044 0.230742 0.225205 0.043622 0.295377 -0.120465 0.231217 0.120423 0.306544 0.190860 0.106365 0.003117 0.000869 0.057769
polarizability: 2.45912198e+02 -1.26115430e+01 2.11811439e+02 8.57480800e-01 -9.85483570e+00 1.23193163e+02
1716.lowfreq: -4.3621 -0.3873 -0.0020 -0.0020 -0.0015 3.5813 8.2780 15.9119 20.9101
frequency: 7.6890 15.8878 20.8572 33.9505 38.9834 47.8918 60.9726 64.4474 73.8516 78.7149 99.0021 111.9567 142.9964 151.2910 177.4600 182.2086 191.7945 225.1489 247.0847 275.3621 292.7851 331.1333 351.0387 367.5893 381.8225 397.8565 418.8037 434.8687 456.0116 465.7719 506.3583 516.7527 549.9871 563.7802 576.6732 592.5867 602.7426 654.0238 682.8205 688.9613 705.9275 712.2967 724.2843 757.3349 771.6070 809.0250 830.5063 843.0736 884.9054 902.7443 919.8088 933.4018 946.7550 968.8883 991.3707 1008.6312 1012.4632 1042.5985 1042.9930 1067.2421 1082.8831 1109.5906 1126.1985 1133.3503 1159.9969 1188.5923 1193.4309 1198.1675 1235.1239 1248.8924 1264.4741 1279.1324 1299.9067 1309.0329 1311.8185 1332.3034 1354.1626 1361.6449 1365.7546 1378.4399 1384.8787 1415.1760 1416.7418 1445.6305 1452.4303 1454.7543 1455.1355 1458.2740 1621.7772 1638.5381 1641.6999 1661.2011 1665.2588 2995.6905 3004.7137 3007.7335 3029.6029 3055.9054 3060.1248 3080.8570 3088.7441 3097.4430 3120.5959 3126.8155 3144.7367 3149.7612 3198.6787 3523.2843
redmass: 7.7125 8.1730 6.6287 7.4672 5.8743 2.0274 1.8873 2.4188 1.6519 2.7103 5.4535 5.3584 7.6109 4.6836 7.8168 6.6468 8.8301 6.3215 2.9685 6.4002 11.0241 5.1247 3.9507 7.7881 5.0506 4.9661 4.6593 3.3380 7.6139 9.0349 3.6030 3.4321 4.4272 3.2129 4.0394 5.1069 5.2833 5.1608 4.9393 2.1021 5.7654 9.5150 7.0614 7.7487 2.1764 2.7057 5.2786 3.2495 3.7135 1.3472 3.7492 2.1752 2.4941 2.4078 1.9005 1.9938 2.0629 1.6766 3.3572 2.4919 3.8993 2.3919 6.9106 1.9093 1.3243 2.0267 2.0574 3.6790 1.6075 1.7587 1.1978 1.3438 1.4751 2.2514 1.3727 1.3247 1.6542 1.8298 1.7954 1.1897 1.2432 3.2806 1.1086 1.0533 1.0582 1.0640 1.0490 1.0896 6.3007 9.8812 12.5697 9.5934 6.5961 1.0364 1.0851 1.0376 1.0673 1.0863 1.0583 1.0874 1.0961 1.0962 1.1020 1.0994 1.1013 1.1064 1.0930 1.0771
irintensity: 0.1899 0.1197 0.2372 0.2653 1.2184 3.0680 3.2516 1.6776 0.1475 0.7131 2.1100 4.0710 2.0320 3.1884 5.9727 6.4182 5.0070 4.7953 6.9214 9.6570 0.1894 4.5009 13.0164 13.6601 3.3634 4.2194 1.7104 4.6201 6.2764 1.3721 2.6492 3.6351 22.4736 6.1806 73.3446 3.5577 10.9731 4.0269 1.3494 8.2485 14.6042 3.8181 19.9475 28.1498 116.6220 2.1910 18.2736 35.6150 27.6944 40.2002 86.8111 4.5818 7.6733 75.3009 66.9610 119.3375 76.4818 5.6433 128.8205 25.5717 73.4292 150.3444 63.0593 34.3933 96.6612 225.1896 145.0999 13.0309 2.0747 163.3328 22.5445 6.0652 23.8073 91.3884 16.4868 1.8042 4.4253 5.5343 20.7419 43.7504 60.0364 54.4138 23.2794 23.4550 23.7360 21.8010 18.2633 12.9631 269.4294 154.5192 181.4136 202.2538 576.1541 0.9147 8.7500 1.1433 5.4374 7.9502 4.4134 10.8604 4.9420 5.7748 6.2633 2.6163 8.2298 0.1533 20.2452 68.2118
temp: 298.150 k
press: 1.00000 atm
elementType: 16 9 8 8 8 8 8 8 7 7 6 6 6 6 6 6 6 6 6 6 6 6 6 1 1 1 1 1 1 1 1 1 1 1 1 1 1 1
symmnumber: 1
zpe: 725444.5 jmol-1
zpe.correction: 0.276307 hartree
zpe.thermalcorrener: 0.300055 hartree
zpe.thermalcorrenthalpy: 0.301000 hartree
zpe.thermalcorrgfe: 0.216888 hartree
zpe.sumelectzpe: -1561.432959 hartree
zpe.sumelectthermal: -1561.409211 hartree
zpe.sumelectthermalent: -1561.408267 hartree
zpe.sumelectthermalfe: -1561.492378 hartree
dipole: -7.5676 1.1473 -0.6114
dipole: 7.6785
quadrupole: -157.3827 -149.2847 -140.7648
quadrupole: 18.0462 0.1172 -10.1952
quadrupole: -8.2386 -0.1406 8.3792 18.0462 0.1172 -10.1952
hfenergy: -1561.7092661 hartree
pointgroup: C01 [X(C13H15F1N2O6S1)]
dipole: 2.9160061 -0.7638656 -0.1988144 debye
polarizability: 242.2560446|-17.471703|210.306368|4.1954792|22.2477534|128.3543866 unknown
InChI: InChI=1S/C13H15FN2O6S/c1-6(17)21-9-3-11(22-10(9)5-23-7(2)18)16-4-8(14)12(19)15-13(16)20/h4,9-11,15H,3,5H2,1-2H3
charge 0 multiplicity 1
38 atoms
S  4.351135 0.511273 -0.031686
F  -3.441322 3.363952 0.338985
O  0.306587 0.479639 -0.953517
O  1.991979 -2.046932 -0.54504
O  -2.988928 -2.048039 -0.603418
O  2.333671 -3.621113 1.143828
O  -5.749329 1.63532 0.332474
O  3.36767 2.983893 0.648083
N  -1.986871 0.063215 -0.368459
N  -4.327731 -0.169717 -0.148006
C  1.432923 -1.110421 0.469137
C  1.534006 0.316689 -0.101053
C  -0.085077 -1.324544 0.603268
C  -0.653312 -0.573456 -0.6263
C  2.732324 0.635287 -0.993059
C  -3.100814 -0.808319 -0.390857
C  -2.115345 1.428918 -0.131828
C  2.423374 -3.299979 -0.05945
C  -3.340011 1.992087 0.111196
C  -4.582541 1.213268 0.123914
C  4.322016 2.1900 0.790264
C  2.996965 -4.127655 -1.184776
C  5.571127 2.466499 1.601408
H  1.976748 -1.245347 1.417662
H  1.475925 1.047217 0.729781
H  -0.372438 -2.385339 0.617042
H  -0.444804 -0.85288 1.535841
H  -0.785182 -1.243438 -1.492503
H  2.655126 1.668928 -1.365282
H  2.81197 -0.079161 -1.823844
H  -1.19569 2.014982 -0.18443
H  -5.151438 -0.780553 -0.159974
H  2.320358 -4.121161 -2.055259
H  3.162007 -5.158161 -0.839463
H  3.960613 -3.696657 -1.510985
H  6.156605 1.55361 1.793618
H  5.292561 2.943138 2.556811
H  6.206245 3.182258 1.046578
