program: Gaussian 09
title: 000251468
version: EM64L-G09RevD.01
frameworkgroup: C1[X(C12H13BrN6O)]
method: RPBEPBE
basis: SDD
operation: Freq
keyword: #p
keyword: freq=noraman
keyword: PBEPBE/SDD
title: #p freq=noraman PBEPBE/SDD
converged: YES YES NO NO
title: Mulliken charges:
elementType: Br O N N N N N N C C C C C C C C C C C C H H H H H H H H H H H H H
charge: 0.011176 -0.342043 -0.246683 -0.126640 -0.361091 -0.098424 -0.007203 -0.576159 0.211982 0.477837 -0.129696 -0.621992 0.223875 -0.325947 -0.358888 -0.038050 -0.170265 -0.168115 -0.230447 -0.622371 0.257069 0.266399 0.225313 0.257425 0.253136 0.251906 0.252050 0.351525 0.245370 0.246706 0.220948 0.333668 0.337629
chargesum: 0.00000
title: Mulliken charges with hydrogens summed into heavy atoms:
elementType: Br O N N N N N N C C C C C C C C C C C C
charge: 0.011176 -0.342043 -0.246683 -0.126640 -0.009566 -0.098424 -0.007203 0.095138 0.211982 0.477837 -0.129696 0.126789 0.223875 -0.068522 -0.105752 -0.038050 0.081641 0.083935 -0.230447 0.090652
polarizability: 3.41529452e+02 1.75149628e+01 1.96350382e+02 8.18698092e+00 -6.14611096e+00 1.15036867e+02
1716.lowfreq: -9.7082 -3.1423 0.0004 0.0006 0.0008 1.0871 18.8389 24.9575 34.0897
frequency: 18.6191 24.7965 34.0812 45.3263 83.6400 104.2195 125.6429 135.9291 158.0289 169.5777 185.1125 195.6442 210.8341 245.7302 257.7814 265.7251 293.0206 322.3922 358.5640 391.8733 400.1171 405.8255 408.5451 435.7057 462.2358 505.3917 521.6348 563.3548 568.3239 584.8724 621.8576 633.0849 671.9512 694.5720 716.1504 718.7245 764.2010 778.6641 796.2409 823.6181 833.1103 918.1015 949.6040 964.2024 968.6781 969.9045 993.8236 1034.0768 1058.0846 1094.5349 1104.5852 1108.0636 1112.0113 1119.7002 1151.0403 1178.7029 1180.2295 1203.8401 1249.0178 1265.8159 1287.3702 1307.2526 1360.2417 1379.8719 1388.3597 1422.6235 1429.7316 1438.9768 1453.2018 1456.2864 1456.4782 1473.2728 1479.0323 1483.7922 1506.3971 1555.6995 1578.3785 1581.2851 1594.2991 1614.9285 2986.6250 3007.4209 3039.6988 3066.2380 3101.5887 3111.7408 3119.3173 3146.3473 3157.9839 3172.8839 3178.3106 3551.8940 3712.7762
redmass: 5.6196 4.5818 7.5019 4.4419 1.0361 4.0559 4.3574 4.7728 9.3010 3.5160 1.7531 3.6054 3.8199 6.1939 5.5881 4.0792 7.9894 4.2888 4.5075 3.9953 7.5860 5.9905 2.9336 6.5440 5.0226 1.2170 3.9710 1.0543 5.7385 5.5118 6.7887 5.6535 8.2977 4.8935 9.0718 3.9232 5.6641 8.3837 6.5129 1.2535 1.6074 1.1512 1.3409 1.9150 3.7733 2.5990 4.7148 1.8800 2.5718 3.4137 1.4836 1.3540 1.2944 1.7523 2.1601 3.3978 1.1177 4.2728 7.5486 4.0161 1.2782 5.2490 5.8227 4.8076 3.7023 1.6105 1.4176 3.7293 1.2409 1.0592 1.0680 2.0130 1.2749 1.6274 2.4652 3.4409 2.4464 6.7748 6.2354 1.9703 1.0356 1.0327 1.0844 1.1001 1.1013 1.1009 1.1030 1.0896 1.0887 1.0962 1.0978 1.0442 1.1060
irintensity: 1.9105 0.6272 0.4284 2.6834 0.0485 1.9934 4.2283 0.5942 0.8938 0.6550 0.4580 1.9310 1.8819 2.8104 0.9545 1.6333 23.2100 1.2332 12.4122 10.0870 6.5842 1.7315 0.5597 6.6910 4.7824 276.1368 13.1360 0.9488 18.5975 3.3200 0.5881 3.4448 1.6375 1.6987 5.1400 3.6310 19.8684 9.5054 10.0723 2.8325 48.3107 109.3634 0.1227 0.6200 19.0473 10.5378 98.9137 14.5290 35.0369 12.2456 2.3379 6.9835 3.0596 43.3021 56.1669 152.8423 2.0203 9.0522 71.2538 46.4186 3.9409 128.4944 2.0929 36.7753 7.3910 74.5524 138.8121 364.1032 16.9492 12.2777 32.9222 127.5115 79.6260 211.5787 401.5236 467.3452 436.1965 45.3428 6.2524 293.7531 77.4755 24.7782 123.2532 26.2087 9.5817 21.4157 30.1777 5.4974 3.9484 6.4889 1.2634 132.8360 47.4651
temp: 298.150 k
press: 1.00000 atm
elementType: 35 8 7 7 7 7 7 7 6 6 6 6 6 6 6 6 6 6 6 6 1 1 1 1 1 1 1 1 1 1 1 1 1
symmnumber: 1
zpe: 644542.2 jmol-1
zpe.correction: 0.245493 hartree
zpe.thermalcorrener: 0.264739 hartree
zpe.thermalcorrenthalpy: 0.265683 hartree
zpe.thermalcorrgfe: 0.195130 hartree
zpe.sumelectzpe: -880.792763 hartree
zpe.sumelectthermal: -880.773518 hartree
zpe.sumelectthermalent: -880.772574 hartree
zpe.sumelectthermalfe: -880.843126 hartree
dipole: 0.2797 3.0873 0.6390
dipole: 3.1652
quadrupole: -133.7739 -119.0485 -121.5033
quadrupole: -17.6522 -0.7119 -4.4291
quadrupole: -8.9987 5.7267 3.2719 -17.6522 -0.7119 -4.4291
hfenergy: -881.0382564 hartree
pointgroup: C01 [X(C12H13Br1N6O1)]
dipole: 0.2952047 -1.0179319 -0.6537293 debye
polarizability: 310.8227893|67.9197081|180.0860771|8.703062|47.8877354|162.0078344 unknown
InChI: InChI=1S/C12H13BrN6O/c1-15-10-9(18-20)11(17-12(14)16-10)19(2)8-5-3-7(13)4-6-8/h3-6,15H,14H2,1-2H3
charge 0 multiplicity 1
33 atoms
Br -5.812006 -2.44771 -0.955331
O  2.896945 2.744408 1.662347
N  -0.663949 0.535646 0.886842
N  0.58847 -0.84864 -0.495151
N  4.207145 1.059855 0.22242
N  3.014178 -0.655137 -0.843339
N  1.755209 2.098315 1.429225
N  1.743813 -2.313783 -1.876471
C  0.57334 0.228152 0.343533
C  -1.834191 -0.198329 0.433972
C  1.807614 0.964571 0.628147
C  -0.90335 1.561383 1.935534
C  3.026698 0.430627 -0.015476
C  -2.290402 -0.075969 -0.89914
C  -2.561231 -0.988093 1.353698
C  1.785692 -1.227499 -1.040456
C  -3.463824 -0.738942 -1.315161
C  -3.739957 -1.655373 0.950833
C  -4.176243 -1.52272 -0.382268
C  5.47285 0.624218 -0.37202
H  -0.2213 1.425457 2.789569
H  -0.729344 2.577129 1.546183
H  -1.949583 1.462924 2.265206
H  -1.724148 0.530344 -1.611681
H  -2.200637 -1.098669 2.381892
H  -3.817893 -0.64102 -2.345184
H  -4.29757 -2.270744 1.662217
H  4.103023 1.89631 0.851024
H  5.429967 0.665506 -1.475583
H  5.703163 -0.419063 -0.091009
H  6.27641 1.28642 -0.012161
H  2.60662 -2.646753 -2.298837
H  0.85379 -2.779123 -2.036372
