program: Gaussian 09
title: 000251453
version: EM64L-G09RevD.01
frameworkgroup: C1[X(C11H13N3O2)]
method: RPBEPBE
basis: SDD
operation: Freq
keyword: #p
keyword: freq=noraman
keyword: PBEPBE/SDD
title: #p freq=noraman PBEPBE/SDD
converged: YES YES NO NO
title: Mulliken charges:
elementType: O O N N N C C C C C C C C C C C H H H H H H H H H H H H H
charge: -0.208513 -0.226862 -0.408568 -0.096222 0.019048 0.469067 0.018501 -0.537838 0.264265 -0.432958 0.262377 -0.366856 -0.399744 -0.197655 -0.621860 -0.621816 0.188998 0.261231 0.277105 0.313039 0.236807 0.267472 0.234145 0.256043 0.184700 0.221018 0.226718 0.181675 0.236683
chargesum: 0.00000
title: Mulliken charges with hydrogens summed into heavy atoms:
elementType: O O N N N C C C C C C C C C C C
charge: -0.208513 -0.226862 -0.095529 -0.096222 0.019048 0.469067 0.018501 -0.087609 0.264265 -0.155853 0.262377 -0.130049 -0.132272 0.036490 0.039902 0.023259
polarizability: 1.89354109e+02 -1.77108664e+00 1.80544414e+02 -1.55325017e+01 1.30332976e+01 9.41866689e+01
1716.lowfreq: -6.6924 -3.2461 -0.0007 -0.0002 0.0002 7.2667 39.2124 58.6173 75.9966
frequency: 39.0346 58.6100 75.9854 101.9235 127.2396 194.0276 202.5633 214.7329 226.4172 236.1531 261.8094 312.6449 336.3995 354.6070 377.8132 401.0583 450.1206 473.1191 516.2335 529.0093 560.9507 580.0104 620.6679 638.8486 683.4743 721.9909 729.4529 754.5269 795.3325 803.9884 821.4589 836.9280 903.6093 957.1488 963.2298 969.4909 1021.6880 1040.6589 1053.3675 1085.3864 1091.6318 1111.9782 1132.6600 1156.1629 1174.7174 1197.7162 1231.1565 1236.3521 1261.9055 1279.3255 1295.0684 1345.9141 1358.2123 1368.6506 1389.3201 1417.5916 1419.8232 1437.4065 1456.2118 1463.9940 1464.3028 1472.6242 1475.2884 1477.8635 1484.7238 1559.5061 1574.6158 1630.4397 2839.2171 2842.9350 2863.2999 3021.3654 3024.1542 3038.8435 3079.0741 3084.3095 3138.5741 3160.6373 3182.1814 3224.9511 3613.0493
redmass: 5.2379 5.0505 2.6944 4.9360 6.6218 6.2638 4.8038 1.3460 3.1724 1.1041 2.6790 3.6147 4.9519 3.4074 2.6682 3.8316 3.1931 3.3113 4.5048 1.3225 3.5574 5.4119 4.1741 3.9443 7.2213 5.5022 4.5338 2.5530 2.3270 2.3955 2.6807 3.3650 1.4058 2.5284 1.4061 2.9739 2.2648 1.5948 2.7390 2.1129 1.2663 1.6552 1.4013 1.4831 1.7975 1.8580 3.2836 2.3591 2.5571 1.8816 2.3474 2.1989 10.1984 1.4405 5.9363 1.2315 1.8180 1.1674 1.0936 1.1322 4.8737 1.1005 1.1071 2.3698 1.0678 5.9403 6.4918 7.5972 1.0683 1.0588 1.0587 1.0711 1.0726 1.0854 1.1011 1.1010 1.0883 1.0932 1.0965 1.0985 1.0812
irintensity: 0.9948 2.1497 0.2600 1.3691 0.3841 3.7069 1.2966 2.5766 5.1032 0.9034 4.1786 1.2349 3.6355 1.9814 0.8459 3.2349 1.1289 7.9555 25.0658 77.6068 8.9908 4.2896 6.3218 2.7893 23.1193 27.8086 15.3171 37.9525 48.8825 5.4934 6.6743 21.9922 1.0412 1.0592 3.3354 6.3609 44.3340 11.5679 16.9689 26.6024 3.1884 29.8938 4.7456 15.1734 2.1644 61.4988 142.5562 56.9260 8.8133 3.0861 17.9991 9.9415 127.2542 4.6648 83.9386 3.1672 8.2988 2.6932 4.0550 17.3751 8.5966 12.0269 15.4673 0.4224 10.6902 12.3839 6.5631 2.0360 52.6726 88.3174 330.3759 26.6290 33.2212 5.5400 16.7677 39.4266 4.4070 14.3358 5.2004 0.1849 77.1658
temp: 298.150 k
press: 1.00000 atm
elementType: 8 8 7 7 7 6 6 6 6 6 6 6 6 6 6 6 1 1 1 1 1 1 1 1 1 1 1 1 1
symmnumber: 1
zpe: 598787.6 jmol-1
zpe.correction: 0.228066 hartree
zpe.thermalcorrener: 0.242590 hartree
zpe.thermalcorrenthalpy: 0.243535 hartree
zpe.thermalcorrgfe: 0.186597 hartree
zpe.sumelectzpe: -740.405575 hartree
zpe.sumelectthermal: -740.391051 hartree
zpe.sumelectthermalent: -740.390107 hartree
zpe.sumelectthermalfe: -740.447044 hartree
dipole: -3.4174 -5.9735 0.8030
dipole: 6.9287
quadrupole: -77.9314 -87.7816 -98.6687
quadrupole: 0.0608 -0.7603 1.8277
quadrupole: 10.1958 0.3457 -10.5415 0.0608 -0.7603 1.8277
hfenergy: -740.6336414 hartree
pointgroup: C01 [X(C11H13N3O2)]
dipole: 0.8047273 -2.6044058 -0.0157477 debye
polarizability: 188.1289172|-3.3362202|176.4402585|-21.3947255|-19.8254374|99.516016 unknown
InChI: InChI=1S/C11H13N3O2/c1-13(2)7-8-6-12-9-4-3-5-10(11(8)9)14(15)16/h3-6,12H,7H2,1-2H3
charge 0 multiplicity 1
29 atoms
O  -0.105468 2.912542 -0.753957
O  -0.756492 2.000726 1.23325
N  1.042498 -2.699614 0.561876
N  -2.551753 0.011463 -0.322517
N  -0.078966 1.970134 0.129752
C  -0.671269 -1.189076 0.737426
C  0.520315 -0.489642 0.291249
C  -2.054086 -0.622001 0.925153
C  1.574642 -1.469339 0.162687
C  -0.305066 -2.527639 0.892804
C  0.848321 0.842944 -0.083526
C  2.865021 -1.164397 -0.316742
C  2.117259 1.162488 -0.605835
C  3.120059 0.164617 -0.713733
C  -3.639811 0.976197 -0.076697
C  -2.861309 -0.958383 -1.387283
H  -2.741649 -1.429261 1.288315
H  -2.026825 0.166377 1.698203
H  -0.921687 -3.367911 1.207136
H  1.547216 -3.582896 0.572066
H  3.644028 -1.930901 -0.390829
H  2.320763 2.194984 -0.902494
H  4.107244 0.437819 -1.099204
H  -3.281165 1.757861 0.61595
H  -4.56144 0.510211 0.356079
H  -3.919675 1.46371 -1.02742
H  -3.113944 -0.418059 -2.316899
H  -3.719715 -1.633265 -1.133462
H  -1.978346 -1.590289 -1.587845
