program: Gaussian 09
title: 000019476
version: EM64L-G09RevD.01
frameworkgroup: C1[X(C11H19N)]
method: RPBEPBE
basis: SDD
operation: Freq
keyword: #pfreq=noraman
keyword: PBEPBE/SDD
title: #p freq=noraman PBEPBE/SDD
converged: NO YES NO NO
title: Mulliken charges:
elementType: N C C C C C C C C C C C H H H H H H H H H H H H H H H H H H H
charge: -0.359264 0.382007 -0.085385 -0.088124 -0.087485 -0.532448 -0.529395 -0.506161 -0.448492 -0.448944 -0.451903 -0.664461 0.193531 0.192515 0.190585 0.223739 0.180070 0.196134 0.218609 0.186383 0.201250 0.192219 0.194417 0.189242 0.194350 0.194819 0.190730 0.240583 0.192993 0.216944 0.230942
chargesum: 0.00000
title: Mulliken charges with hydrogens summed into heavy atoms:
elementType: N C C C C C C C C C C C
charge: -0.118682 0.382007 0.108146 0.104391 0.103100 -0.128639 -0.114652 -0.118528 -0.061857 -0.065352 -0.066354 -0.023582
polarizability: 1.26551713e+02 -4.33636441e-01 1.08434832e+02 7.12924593e-01 6.93442637e-01 1.06269646e+02
1716.lowfreq: -13.7402 -0.0008 -0.0004 0.0002 22.8129 42.8685 87.2577 176.8362 203.2116
frequency: 86.4723 176.6701 203.2050 263.5245 298.6514 300.3727 373.7632 376.2056 390.4463 391.8193 416.4758 434.6971 453.4638 527.9066 630.3735 636.0912 648.2862 700.3269 766.7964 807.6803 814.5532 868.3908 871.0437 877.9105 898.0926 936.4912 942.3474 966.6752 973.3180 975.9153 1031.5638 1039.9963 1046.7632 1048.7783 1094.2651 1096.6174 1097.0181 1101.3370 1108.0919 1112.9082 1127.5234 1165.8019 1180.6761 1189.5422 1254.8821 1270.5278 1277.8542 1287.5218 1288.6483 1301.6993 1305.7837 1312.0538 1322.2015 1339.0285 1341.9206 1348.8977 1355.1056 1360.9069 1435.9297 1449.2670 1449.9687 1456.5690 1461.2224 1463.5753 1466.4464 1470.8482 1482.7327 1499.7256 2882.5749 2947.2656 2953.3231 2959.1927 2961.2062 2962.5460 2970.4668 2987.3319 2990.6594 3002.7694 3011.0045 3017.6139 3019.5368 3022.3268 3026.6685 3027.6561 3036.1609 3075.2993 3424.4933
redmass: 2.0255 2.1237 1.4236 2.0280 2.1356 2.1011 2.2036 2.6091 4.3622 4.5513 1.8133 1.7417 1.9912 2.6694 2.6118 3.6951 1.9961 3.3051 3.5310 2.7032 2.6700 1.5919 1.5813 1.5467 3.0348 2.0129 1.9955 2.1530 2.1180 2.1496 2.4543 1.6925 1.7194 2.0884 1.0661 1.4182 1.5437 1.2828 1.0150 1.3737 1.4432 3.0374 1.1954 1.1792 1.6402 1.8022 1.8419 2.0135 1.9620 2.0942 1.7899 1.7257 1.3207 1.4298 1.4640 1.5010 1.5927 1.5961 1.1540 1.0904 1.1048 1.1493 1.0934 1.1293 1.0941 1.0707 1.0898 1.0496 1.0560 1.0632 1.0611 1.0640 1.0615 1.0616 1.0617 1.0829 1.0832 1.0830 1.1018 1.1017 1.1009 1.0771 1.1004 1.0996 1.1008 1.0999 1.0739
irintensity: 1.7037 1.2140 0.1624 2.2549 1.2606 0.6128 6.0656 0.0325 0.0540 0.6498 2.1960 5.0714 1.6936 31.0674 27.4483 2.9722 51.0555 5.6994 0.5364 3.7765 2.8298 0.1893 0.0410 0.1122 1.7196 2.9840 1.6053 2.2635 3.8005 0.3181 4.8508 1.9142 0.1056 0.7487 1.2532 2.5969 10.8040 4.5871 0.1407 1.9864 17.9165 25.3269 3.3684 0.2772 3.7276 0.4281 3.0644 0.1337 0.3942 13.1737 4.6384 2.0459 0.0213 1.5275 1.7993 12.3855 1.0604 3.8294 5.7523 0.8177 0.0608 13.0851 16.5293 13.8921 11.3383 4.0547 1.1050 18.7123 105.3059 23.2303 58.5912 17.1718 25.3128 16.5857 49.5724 160.0865 171.4003 40.8307 18.2124 14.5445 25.1957 42.0667 72.5639 75.6746 66.3148 36.6527 3.2170
temp: 298.150 k
press: 1.00000 atm
elementType: 7 6 6 6 6 6 6 6 6 6 6 6 1 1 1 1 1 1 1 1 1 1 1 1 1 1 1 1 1 1 1
symmnumber: 1
zpe: 740071.3 jmol-1
zpe.correction: 0.281878 hartree
zpe.thermalcorrener: 0.292057 hartree
zpe.thermalcorrenthalpy: 0.293002 hartree
zpe.thermalcorrgfe: 0.247435 hartree
zpe.sumelectzpe: -484.366992 hartree
zpe.sumelectthermal: -484.356812 hartree
zpe.sumelectthermalent: -484.355868 hartree
zpe.sumelectthermalfe: -484.401434 hartree
dipole: -0.1867 -0.2397 0.9016
dipole: 0.9514
quadrupole: -73.9696 -74.1953 -75.6350
quadrupole: -0.7337 2.8060 1.8785
quadrupole: 0.6304 0.4046 -1.0350 -0.7337 2.8060 1.8785
hfenergy: -484.6488698 hartree
pointgroup: C01 [X(C11H19N1)]
dipole: -0.0740125 -0.1400995 0.3391061 debye
polarizability: 126.5466062|-0.6139259|108.2203203|0.6463994|0.9504344|106.489265 unknown
InChI: InChI=1S/C11H19N/c1-12-11-5-8-2-9(6-11)4-10(3-8)7-11/h8-10,12H,2-7H2,1H3
charge 0 multiplicity 1
31 atoms
N  2.39194 0.636165 -0.022519
C  0.951908 0.258248 0.019044
C  -1.387942 1.295887 -0.001658
C  -0.953641 -0.862546 -1.254862
C  -0.982563 -0.852376 1.282746
C  0.136133 1.583246 0.003666
C  0.57105 -0.566688 -1.242292
C  0.542537 -0.553214 1.292641
C  -1.745957 0.472721 -1.268589
C  -1.7709 0.485891 1.266306
C  -1.333555 -1.675706 0.01321
C  3.406486 -0.436579 -0.01445
H  -1.941269 2.255882 -0.011648
H  -1.201606 -1.450886 -2.160754
H  -1.25169 -1.432545 2.18824
H  0.429816 2.167872 -0.889478
H  0.403753 2.188657 0.896616
H  1.12889 -1.524401 -1.255184
H  0.871928 0.00357 -2.142529
H  0.811995 0.029904 2.198242
H  1.111303 -1.503968 1.332003
H  -2.83527 0.267821 -1.295048
H  -1.497731 1.052695 -2.180044
H  -1.538986 1.073918 2.177472
H  -2.861297 0.285269 1.275138
H  -2.416335 -1.913142 0.001687
H  -0.785409 -2.639502 0.023185
H  2.59187 1.349433 0.693343
H  3.362908 -1.13172 0.858237
H  4.409374 0.026361 -0.026711
H  3.319658 -1.046668 -0.931011
