program: Gaussian 09
title: 000251444
version: EM64L-G09RevD.01
frameworkgroup: C1[X(C16H24O)]
method: RPBEPBE
basis: SDD
operation: Freq
keyword: #pfreq=noraman
keyword: PBEPBE/SDD
title: #p freq=noraman PBEPBE/SDD
converged: NO YES NO NO
title: Mulliken charges:
elementType: O C C C C C C C C C C C C C C C C H H H H H H H H H H H H H H H H H H H H H H H H
charge: -0.437133 0.020100 0.192502 -0.476451 -0.494045 0.023748 -0.444043 -0.446184 0.473771 -0.758105 -0.824109 -0.749333 -0.368533 -0.393251 -0.430788 -0.378700 0.282697 0.184917 0.192410 0.226488 0.207713 0.202386 0.193381 0.186596 0.195583 0.194527 0.187125 0.214450 0.226552 0.208407 0.219147 0.228687 0.223725 0.211770 0.207369 0.212993 0.223924 0.246751 0.215330 0.246180 0.351446
chargesum: 0.00000
title: Mulliken charges with hydrogens summed into heavy atoms:
elementType: O C C C C C C C C C C C C C C C C
charge: -0.085688 0.205017 0.192502 -0.057553 -0.083946 0.217129 -0.061864 -0.064531 0.473771 -0.108695 -0.152550 -0.117201 -0.144609 -0.146500 -0.215458 -0.132521 0.282697
polarizability: 2.09040213e+02 -2.08272220e+01 1.54880951e+02 5.51583901e+00 7.67038723e+00 1.51617056e+02
1716.lowfreq: -3.7138 -0.0006 -0.0003 0.0006 9.5928 19.6716 37.0882 41.1353 50.2058
frequency: 36.2631 40.7891 50.0110 86.1974 145.1616 179.8762 198.1046 212.7295 217.2678 235.6725 250.6654 268.5573 283.1435 302.4649 321.6863 331.4404 341.7973 347.3826 381.4879 410.7800 411.9865 426.4324 457.3496 463.7425 483.1479 515.9427 539.0794 576.7273 637.4956 690.7446 732.7297 756.4759 782.1507 799.4446 803.7011 818.6781 834.9413 878.3927 891.3456 911.1052 922.1637 932.6784 937.5976 958.0733 961.3397 981.2753 998.8928 1003.5607 1015.9017 1045.4279 1066.0095 1084.5232 1090.5077 1103.6762 1110.7032 1127.7541 1144.8863 1160.1260 1180.2875 1187.4391 1198.2866 1223.6484 1234.9791 1246.6193 1250.4982 1257.1177 1294.7466 1301.8076 1308.1051 1313.2660 1317.6429 1333.4439 1339.3110 1343.5122 1363.1242 1378.4472 1382.0044 1385.3178 1398.7871 1419.2035 1456.0918 1458.8306 1465.7683 1468.4583 1470.9914 1474.5589 1476.6740 1476.8978 1491.6458 1496.9955 1502.8052 1595.1792 1624.8507 2931.2179 2937.6169 2950.1814 2957.0497 2964.6482 2966.1004 2971.4708 2977.7179 2984.9273 3013.2832 3021.2157 3033.5193 3040.8038 3057.9162 3063.1212 3071.1061 3073.6609 3077.3072 3084.2219 3106.2346 3137.6959 3149.8835 3171.3776 3581.4631
redmass: 3.2147 3.4979 3.7221 3.2227 4.3805 2.7084 1.1894 2.3840 1.5467 2.3043 1.5201 3.3002 2.7190 2.1327 1.1771 2.7511 1.1312 2.8468 2.9666 2.3958 2.2219 2.8757 2.9718 2.9859 2.9893 2.6496 2.8052 2.9344 7.0800 3.0385 3.6126 2.7625 1.5031 2.9376 1.4279 2.9278 1.5530 2.1802 1.6079 1.5507 1.5536 1.3912 1.8725 1.3884 1.3529 2.2514 1.4552 2.5503 1.6158 2.1813 1.0905 1.9098 2.0169 2.0782 2.4126 1.9717 1.3632 2.1433 2.3200 1.1455 2.5301 1.5618 1.7608 2.4105 1.4063 1.5778 1.4129 1.2889 1.2740 1.2648 1.3798 1.4158 1.5244 1.5781 1.5367 1.4092 2.9391 1.2195 1.2112 3.0947 1.0862 1.0895 1.0846 1.0742 1.0841 1.0522 1.0596 1.0616 1.0610 1.1236 2.1110 6.2645 6.3450 1.0806 1.0801 1.0617 1.0624 1.0380 1.0617 1.0625 1.0356 1.0370 1.0976 1.0978 1.1009 1.0996 1.0989 1.0992 1.0994 1.0986 1.0993 1.0980 1.0880 1.0945 1.0871 1.0962 1.0660
irintensity: 0.0279 0.6858 0.2858 0.1341 0.3001 0.2372 0.2937 0.6214 0.0320 0.2536 0.0210 0.2222 0.3853 0.2986 0.5322 0.1209 140.9186 1.4326 6.6857 1.6042 1.2492 2.3661 1.3814 2.0561 3.0930 3.2123 23.0436 9.2450 0.4982 9.0717 1.2646 2.4004 0.1606 16.6181 25.8334 3.6651 39.4111 2.1745 7.8513 3.8276 0.0974 1.4247 2.5503 0.6362 0.8313 17.6940 0.5181 11.2042 4.0550 1.7782 0.1989 1.4077 2.7834 38.6929 7.1124 18.8241 215.4767 7.6389 3.0567 10.3619 7.8625 1.7246 4.5165 25.4518 0.7513 9.6841 0.2222 2.2273 9.3139 2.2655 5.9052 0.4137 1.0887 0.5119 6.9978 34.2599 12.7370 9.8916 20.4902 13.3656 0.3665 6.5422 11.3539 1.0508 2.9556 15.1134 9.8372 2.3734 10.1201 40.0715 81.9457 6.5155 31.1748 16.2414 2.0227 31.9501 41.0041 74.8100 13.1301 26.1341 28.2858 28.3285 67.0288 38.1259 39.4713 52.0906 76.8803 41.9125 26.0111 27.9467 48.3881 61.9464 22.6119 20.3561 6.8760 9.0786 36.6595
temp: 298.150 k
press: 1.00000 atm
elementType: 8 6 6 6 6 6 6 6 6 6 6 6 6 6 6 6 6 1 1 1 1 1 1 1 1 1 1 1 1 1 1 1 1 1 1 1 1 1 1 1 1
symmnumber: 1
zpe: 945882.9 jmol-1
zpe.correction: 0.360268 hartree
zpe.thermalcorrener: 0.377577 hartree
zpe.thermalcorrenthalpy: 0.378521 hartree
zpe.thermalcorrgfe: 0.315983 hartree
zpe.sumelectzpe: -698.011655 hartree
zpe.sumelectthermal: -697.994346 hartree
zpe.sumelectthermalent: -697.993402 hartree
zpe.sumelectthermalfe: -698.055940 hartree
dipole: -0.8587 -0.0898 -1.4192
dipole: 1.6612
quadrupole: -109.9947 -104.4837 -99.3621
quadrupole: -4.3314 -7.4351 5.9514
quadrupole: -5.3812 0.1298 5.2514 -4.3314 -7.4351 5.9514
hfenergy: -698.3719229 hartree
pointgroup: C01 [X(C16H24O1)]
dipole: -0.338641 -0.0196871 0.5586327 debye
polarizability: 208.7949493|21.5746828|153.6636693|-3.4777458|7.8541224|153.0796005 unknown
InChI: InChI=1S/C16H24O/c1-12-4-6-13(7-5-12)16(2,3)14-8-10-15(17)11-9-14/h8-13,17H,4-7H2,1-3H3
charge 0 multiplicity 1
41 atoms
O  4.860505 1.771536 0.245658
C  -1.223749 -0.503228 0.179924
C  0.017372 -1.436079 -0.142152
C  -1.342739 0.712479 -0.777039
C  -2.58792 -1.241712 0.239107
C  -3.845756 0.952288 -0.244704
C  -2.476105 1.670389 -0.338732
C  -3.726112 -0.28716 0.677284
C  1.311948 -0.58725 -0.048965
C  0.111506 -2.581801 0.913608
C  -0.13322 -2.100135 -1.536688
C  -4.960965 1.907453 0.230475
C  1.677783 0.016698 1.184458
C  2.177132 -0.366842 -1.153192
C  2.842627 0.800655 1.316765
C  3.348032 0.413281 -1.043413
C  3.681717 1.000857 0.194594
H  -1.041778 -0.091822 1.198886
H  -1.553833 0.355383 -1.806416
H  -0.381943 1.258563 -0.817572
H  -2.541651 -2.096666 0.939801
H  -2.83381 -1.654636 -0.760453
H  -4.105705 0.589451 -1.26408
H  -2.229273 2.100046 0.655915
H  -2.546345 2.522299 -1.044227
H  -4.689989 -0.834448 0.697843
H  -3.534597 0.05862 1.715943
H  -0.725354 -3.29493 0.807484
H  1.05395 -3.14395 0.78279
H  0.092307 -2.191176 1.947559
H  0.728488 -2.758122 -1.753726
H  -1.040935 -2.727761 -1.565492
H  -0.212241 -1.360267 -2.352784
H  -5.941327 1.395929 0.269878
H  -4.74083 2.29165 1.245629
H  -5.059704 2.778688 -0.444231
H  1.047266 -0.125216 2.069606
H  1.944576 -0.807833 -2.126858
H  3.09448 1.250439 2.286641
H  4.006223 0.575312 -1.902398
H  4.999668 2.136617 1.154576
