program: Gaussian 09
title: 000251434
version: EM64L-G09RevD.01
frameworkgroup: C1[X(C9H11NO5)]
method: RPBEPBE
basis: SDD
operation: Freq
keyword: #p
keyword: freq=noraman
keyword: PBEPBE/SDD
title: #p freq=noraman PBEPBE/SDD
converged: NO NO NO NO
title: Mulliken charges:
elementType: O O O O O N C C C C C C C C C H H H H H H H H H H H
charge: -0.206262 -0.206266 -0.196954 -0.196452 -0.196476 0.135881 0.253385 -0.365978 -0.365996 -0.112966 -0.699546 0.387885 -0.431060 -0.259731 -0.162344 0.184615 0.277173 0.277187 0.184617 0.205663 0.248602 0.221766 0.248610 0.256833 0.255047 0.262767
chargesum: 0.00000
title: Mulliken charges with hydrogens summed into heavy atoms:
elementType: O O O O O N C C C C C C C C C
charge: -0.206262 -0.206266 -0.196954 -0.196452 -0.196476 0.135881 0.253385 0.095810 0.095808 0.092698 0.019433 0.387885 -0.174227 -0.004684 0.100423
polarizability: 1.48647493e+02 -5.45627910e+00 1.10751339e+02 -1.67348862e-03 1.79635925e-03 9.14030558e+01
1716.lowfreq: -0.0007 -0.0005 -0.0004 2.3432 6.6825 13.6691 39.9646 43.4643 44.3328
frequency: 39.8637 43.3870 44.3328 91.6018 129.7937 161.7461 201.4932 212.4663 258.3039 285.3699 326.3654 326.6271 346.0565 374.8512 443.7386 502.3434 519.9509 536.7241 593.0354 594.3998 667.6911 681.1877 741.7426 761.6546 786.9516 814.1284 852.1928 853.7997 860.9565 882.1489 883.6596 894.5199 921.4552 956.3678 992.6965 993.9357 1018.4426 1044.4900 1047.9654 1098.3433 1137.9053 1161.2554 1207.0146 1207.1351 1217.0331 1251.0275 1263.8406 1280.0742 1304.9148 1344.1291 1345.8835 1367.1865 1372.1258 1397.8259 1409.2609 1437.6315 1442.5795 1470.0733 1480.9676 1486.0160 1601.9171 2891.0513 2939.9348 2949.2906 2995.5222 3096.3259 3101.1769 3114.6715 3117.1086 3219.2240 3234.7951 3269.0678
redmass: 6.4550 8.3677 7.2809 4.8032 6.5147 6.7231 1.0569 4.2152 2.7066 4.2613 3.6596 5.9905 4.5439 2.0892 4.4901 4.2760 4.9604 5.9201 8.2493 2.9523 5.4088 6.4271 1.2541 12.0183 3.7553 1.4783 3.4103 3.4865 6.0932 1.4435 5.1339 1.8094 4.2296 3.3716 2.0125 1.9079 1.6295 3.6992 2.6336 3.3402 1.6264 2.4694 1.2960 1.4552 12.0321 3.1859 2.2861 1.2189 1.1482 2.0570 1.2339 1.3726 2.0546 1.2146 3.7970 1.2852 1.0875 1.0798 1.0506 4.5569 6.7961 1.0831 1.0693 1.0700 1.0352 1.0999 1.1011 1.0922 1.0943 1.0936 1.0979 1.1086
irintensity: 0.0243 0.0924 1.6520 4.7062 2.3124 0.8061 0.0161 1.3442 0.4231 1.3499 2.4213 0.6367 0.0227 13.4596 0.8158 5.2021 0.8644 11.5328 8.1512 6.0079 0.7636 0.3299 82.9717 22.5156 24.1226 83.8998 38.0893 50.0279 21.3187 3.0183 10.6354 7.7472 2.0179 30.7873 0.0132 36.2178 61.2849 163.8407 14.6973 3.2353 19.6887 9.5592 0.1573 1.7225 64.3166 25.5348 4.1116 32.0578 1.8086 47.2365 9.7387 4.1904 12.0751 25.4578 160.3971 5.2649 14.5143 7.4079 18.9250 17.8096 20.1840 58.7421 11.9483 108.1624 17.7068 14.4310 8.4209 3.3125 2.5260 3.5024 0.4698 0.3419
temp: 298.150 k
press: 1.00000 atm
elementType: 8 8 8 8 8 7 6 6 6 6 6 6 6 6 6 1 1 1 1 1 1 1 1 1 1 1
symmnumber: 1
zpe: 513800.6 jmol-1
zpe.correction: 0.195696 hartree
zpe.thermalcorrener: 0.209314 hartree
zpe.thermalcorrenthalpy: 0.210258 hartree
zpe.thermalcorrgfe: 0.154181 hartree
zpe.sumelectzpe: -779.149666 hartree
zpe.sumelectthermal: -779.136049 hartree
zpe.sumelectthermalent: -779.135105 hartree
zpe.sumelectthermalfe: -779.191182 hartree
dipole: -0.0165 -5.9815 0.0003
dipole: 5.9815
quadrupole: -70.2757 -84.3774 -93.6102
quadrupole: -12.1326 0.0023 0.0000
quadrupole: 12.4787 -1.6229 -10.8558 -12.1326 0.0023 0.0000
hfenergy: -779.3453626 hartree
pointgroup: C01 [X(C9H11N1O5)]
dipole: -0.0130992 -2.3532611 -0.0066531 debye
dipolederiv: -1.0906407 0.0498963 -0.1864578 -0.0437721 -0.3484979 0.0082882 -0.1973321 0.0720221 -0.6394072 -1.0913052 0.0489396 0.1859571 -0.0448649 -0.3480491 -0.0066782 0.1962939 -0.070274 -0.6391971 -0.472685 -0.1679663 -0.0008201 -0.1989435 -0.4203115 -0.0011445 -0.0009095 -0.0011157 -0.0858007 -0.2320169 -0.1048138 -0.0884368 -0.1374214 -0.5237006 -0.2107983 0.0111567 -0.0177899 -0.6963549 -0.2322315 -0.1053398 0.0888096 -0.1378032 -0.5249917 0.2114717 -0.0109224 0.0185222 -0.6949352 0.104852 0.2077857 -0.0004694 0.3112702 0.9116573 -0.0002195 -0.0002153 -0.0003025 1.1065993 0.0511065 0.0694931 0.0002733 0.0561195 0.056984 0.0002384 0.0002179 0.0002389 -0.0187002 0.6438918 -0.05677 0.0731206 -0.184117 0.2821411 -0.1358124 -0.103188 -0.0935846 0.1664018 0.6438456 -0.0565066 -0.0726009 -0.184943 0.2808361 0.1361619 0.102981 0.0941671 0.1677549 1.5739646 -0.0541316 0.000309 0.1889823 0.5549733 -0.0012004 0.0010097 -0.0014037 1.0282856 -0.0826937 -0.0534589 -0.00026 -0.0703555 -0.0146947 -0.0002298 -0.0002793 -0.0002012 0.0431249 -0.1673142 0.1817193 0.0004451 0.1796578 0.2798706 0.001177 0.0004235 0.0011835 -0.0728114 0.0074656 -0.1090982 -0.0001401 -0.0139619 0.0013671 0.0005557 0.0001407 0.0004728 -0.1940093 -0.0325306 -0.0123512 0.0001202 0.0385976 -0.1514182 0.0002069 0.000266 0.0001615 -0.2119069 0.1990768 0.138721 0.0006758 0.1556778 0.1595784 0.0009424 0.0007227 0.0009304 -0.1167775 -0.0396459 -0.0205064 0.0003102 0.0891158 -0.1959889 0.0692085 0.0506025 -0.0089866 0.0911086 -0.0074657 0.0144097 -0.0720001 0.0082586 0.1146055 -0.075478 -0.0542485 -0.0167604 0.0248955 -0.0076672 0.0139816 0.0720229 0.0078266 0.1140786 0.0759921 0.0542252 0.0172922 0.0256449 -0.039561 -0.0205202 -0.0006513 0.0895167 -0.1956411 -0.0706857 -0.0503158 0.0073137 0.0906757 -0.0277261 0.0420754 0.0001253 -0.0902893 -0.2068457 -0.000579 -0.0002552 -0.0004674 -0.032117 0.0203171 0.0032587 -0.0470981 -0.014055 0.0920718 -0.0621215 -0.1180309 -0.0319897 -0.0323025 0.0917292 -0.0364021 -0.000112 -0.0210544 -0.1208202 -0.0006514 -0.0000788 -0.0006602 0.1108845 0.0200643 0.0029542 0.0471907 -0.0147986 0.0915473 0.0627798 0.1180268 0.0326632 -0.0315063 0.1404145 0.011894 -0.0000114 0.0037094 -0.0370024 -0.0006614 -0.0000355 -0.0006546 0.1920403 -0.0534753 -0.0021775 -0.0002291 -0.0074301 0.1270378 -0.000231 -0.0002429 -0.0002259 0.2044301 0.0802309 0.0149139 -0.0000728 0.035078 0.0212132 -0.0005315 -0.0000124 -0.0005515 0.2139801 unknown
polarizability: 148.616555|-5.5625769|110.782096|0.0301491|0.0529184|91.4032371 unknown
InChI: InChI=1S/C9H11NO5/c1-9(10(11)12)5-14-8(15-6-9)7-3-2-4-13-7/h2-4,8H,5-6H2,1H3
charge 0 multiplicity 1
26 atoms
O  0.023521 -0.348329 1.207083
O  0.025587 -0.3414 -1.20796
O  -2.270629 1.058674 0.001684
O  2.67257 1.619785 1.144919
O  2.67494 1.626052 -1.130226
N  2.515505 1.051175 0.00561
C  2.211746 -0.497445 0.000972
C  1.400577 -0.854512 1.264398
C  1.402727 -0.8473 -1.265835
C  -0.660534 -0.825765 -0.002397
C  3.595953 -1.182091 0.000208
C  -2.060511 -0.332524 -0.002168
C  -3.280428 -0.988586 -0.005137
C  -4.310179 0.029107 -0.00308
C  -3.659713 1.251699 0.00104
H  1.399396 -1.963507 1.361135
H  1.847581 -0.40024 2.160102
H  1.851236 -0.387949 -2.158185
H  1.40173 -1.955725 -1.368888
H  -0.649073 -1.94362 -0.005601
H  4.172636 -0.899235 0.897799
H  3.472978 -2.279531 -0.002863
H  4.174051 -0.894344 -0.894911
H  -3.43084 -2.066691 -0.008398
H  -5.386367 -0.129643 -0.004472
H  -3.988959 2.286947 0.003772
