program: Gaussian 09
title: 000251438
version: EM64L-G09RevD.01
frameworkgroup: C1[X(C15H26O2)]
method: RPBEPBE
basis: SDD
operation: Freq
keyword: #pfreq=noraman
keyword: PBEPBE/SDD
title: #p freq=noraman PBEPBE/SDD
converged: YES YES NO NO
title: Mulliken charges:
elementType: O O C C C C C C C C C C C C C C C H H H H H H H H H H H H H H H H H H H H H H H H H H
charge: -0.326897 -0.279106 -0.057959 0.390301 -0.477655 -0.487930 -0.527355 -0.039144 -0.770799 -0.760593 -0.327125 0.434341 -0.410958 -0.464064 -0.472922 -0.292096 -0.826746 0.202390 0.239535 0.201754 0.207703 0.240223 0.205163 0.204899 0.234094 0.215854 0.216785 0.241427 0.236736 0.207521 0.217824 0.214503 0.205899 0.202432 0.250367 0.219762 0.231276 0.225083 0.195301 0.219447 0.216547 0.225674 0.218509
chargesum: 0.00000
title: Mulliken charges with hydrogens summed into heavy atoms:
elementType: O O C C C C C C C C C C C C C C C
charge: -0.326897 -0.279106 0.144431 0.390301 -0.036366 -0.040004 -0.117293 0.194950 -0.096734 -0.098512 0.093277 0.434341 -0.208526 0.006066 -0.016563 0.122652 -0.166016
polarizability: 1.99422930e+02 3.23305308e+00 1.51697529e+02 6.80890900e+00 -2.43159179e+00 1.43922196e+02
1716.lowfreq: -17.4357 -10.6459 -8.7250 -0.0004 -0.0003 0.0005 19.4575 28.8256 40.2167
frequency: 18.7112 28.4578 39.8982 57.3493 61.7832 84.7357 144.5919 158.6406 169.6124 186.5473 200.6456 208.4819 237.3750 241.4501 245.8623 267.2548 304.0368 314.0917 350.1507 375.2820 404.2322 408.9787 428.3504 468.4532 473.1334 506.5802 569.1813 582.2264 632.4364 672.0136 718.1190 759.6606 799.4876 804.2277 821.7651 835.5013 858.1533 881.4313 892.3581 911.4591 913.9874 915.2062 924.4319 936.3136 961.2013 980.4538 986.7733 990.0062 1000.3294 1025.6543 1026.4648 1028.1876 1054.1839 1085.5389 1089.5581 1126.7466 1130.0164 1133.8094 1142.5569 1144.7575 1168.4284 1170.3312 1187.7684 1210.4025 1219.1420 1227.7795 1233.7457 1250.6304 1263.0223 1291.1086 1296.6017 1298.1336 1308.7302 1311.3875 1325.2611 1329.7538 1339.0838 1351.4871 1365.3696 1372.0837 1376.1883 1389.4105 1392.5273 1451.7742 1454.8516 1458.1141 1461.4771 1462.6410 1465.4770 1471.0709 1472.0354 1474.1628 1474.7926 1480.4058 1490.3816 1493.0026 1701.5768 2938.7670 2953.5953 2953.9549 2958.7323 2967.4778 2980.6243 2983.0131 2986.1492 2987.5374 3004.8758 3007.5550 3008.6141 3013.1663 3023.2151 3027.0275 3054.2216 3060.5613 3061.0104 3066.6843 3071.3444 3074.5475 3078.3749 3086.4759 3092.1509 3095.2303 3098.4874
redmass: 3.5724 3.3399 3.0854 3.0890 3.4257 3.3441 2.8082 1.9414 1.1648 2.1213 1.6945 1.8118 1.4915 1.6824 3.1154 2.0730 3.0103 2.2460 2.8089 2.2258 2.7862 2.0962 2.2625 3.4340 2.5512 3.5648 3.3669 1.9305 3.4028 4.2412 4.1282 2.7994 1.6983 1.2708 2.2403 2.6888 2.3386 2.7494 1.7382 1.6190 2.4249 1.6446 1.7570 1.8291 2.0686 1.5568 1.4121 3.7568 3.0568 2.3917 1.8008 1.5502 2.2048 1.4616 1.9582 1.6367 1.9339 2.1677 1.2464 1.3251 1.7785 2.3396 2.5099 1.3407 1.5170 1.6934 1.4030 1.6141 1.2280 1.4002 1.3711 1.3989 1.2601 1.2805 1.3017 1.4470 1.3149 1.8766 1.3687 1.5202 1.3782 1.2126 1.2451 1.0756 1.0823 1.0758 1.0541 1.0656 1.0859 1.0817 1.0631 1.0779 1.0630 1.0624 1.0945 1.0546 6.5118 1.0624 1.0464 1.0718 1.0605 1.0663 1.0374 1.0468 1.0884 1.0474 1.0669 1.0667 1.0978 1.0622 1.0965 1.0839 1.1054 1.1022 1.0983 1.0991 1.0983 1.0981 1.1013 1.0905 1.1051 1.0991 1.0987
irintensity: 1.2598 0.7359 0.3894 2.1911 1.5992 0.7385 1.7529 1.2498 0.7675 0.7927 0.0789 0.0541 1.2050 2.4730 8.1244 4.0070 1.3120 0.3972 3.5284 1.7126 1.5775 3.1803 3.6613 2.6285 1.2625 0.5268 1.1378 4.2302 0.5417 4.6641 13.6410 5.4778 0.6498 13.0021 6.5200 6.7265 9.1058 5.5726 4.0156 0.3858 11.7831 1.7147 10.2163 2.0928 4.1657 0.9487 2.0599 138.2434 4.4369 69.1883 67.5453 11.4510 6.1039 21.9055 0.6589 2.3840 46.7587 4.2758 2.3281 9.0678 5.3811 9.4295 13.1595 17.0393 12.3147 6.3413 11.8591 18.9893 2.9169 8.3373 3.3976 9.8632 1.9674 1.0318 2.3771 0.7503 5.2062 1.5876 1.7024 19.7173 20.4596 26.2381 12.1863 2.3348 5.9320 8.3096 6.1235 3.5413 13.1400 10.9731 15.4308 12.2052 1.2941 13.3236 0.5369 17.5925 1.1912 40.7018 56.9385 28.0386 39.1817 101.4750 10.6472 19.6520 20.3663 43.3019 36.7512 9.5737 42.3830 27.9865 31.9219 40.4980 68.1374 46.9075 32.6675 0.2902 23.3709 73.3089 15.9394 49.0264 49.3188 29.5344 29.7252
temp: 298.150 k
press: 1.00000 atm
elementType: 8 8 6 6 6 6 6 6 6 6 6 6 6 6 6 6 6 1 1 1 1 1 1 1 1 1 1 1 1 1 1 1 1 1 1 1 1 1 1 1 1 1 1
symmnumber: 1
zpe: 997939.3 jmol-1
zpe.correction: 0.380095 hartree
zpe.thermalcorrener: 0.398989 hartree
zpe.thermalcorrenthalpy: 0.399933 hartree
zpe.thermalcorrgfe: 0.331635 hartree
zpe.sumelectzpe: -736.236587 hartree
zpe.sumelectthermal: -736.217693 hartree
zpe.sumelectthermalent: -736.216749 hartree
zpe.sumelectthermalfe: -736.285047 hartree
dipole: -0.3066 -0.4304 -0.2614
dipole: 0.5896
quadrupole: -106.8418 -101.4691 -103.9054
quadrupole: -8.9579 -1.8296 -0.4666
quadrupole: -2.7697 2.6030 0.1667 -8.9579 -1.8296 -0.4666
hfenergy: -736.6166825 hartree
pointgroup: C01 [X(C15H26O2)]
dipole: -0.1123111 0.1957584 0.0535459 debye
polarizability: 198.2538698|-6.7363914|149.9059336|-8.7133738|-3.6834229|146.8828512 unknown
InChI: InChI=1S/C15H26O2/c1-12-6-8-13(9-7-12)15(2,3)17-11-14-5-4-10-16-14/h6,13-14H,4-5,7-11H2,1-3H3
charge 0 multiplicity 1
43 atoms
O  0.644393 -0.318537 0.571778
O  4.27842 -0.440019 -0.367557
C  -1.682898 -0.856441 0.234164
C  -0.261812 -1.496691 0.391272
C  -2.113006 -0.016645 1.46451
C  -1.796189 0.018685 -1.04441
C  -3.577179 0.460979 1.33716
C  2.83736 -0.094435 -0.560103
C  0.134134 -2.302559 -0.870153
C  -0.190938 -2.414604 1.637226
C  2.087557 -0.567843 0.701683
C  -3.887004 1.067307 -0.024902
C  -3.056563 0.863515 -1.083756
C  2.786005 1.436794 -0.773948
C  4.055396 1.941341 -0.037352
C  5.068596 0.817342 -0.333237
C  -5.155079 1.892298 -0.129016
H  -2.394767 -1.705086 0.135604
H  -1.435164 0.853159 1.54519
H  -2.005464 -0.600656 2.39697
H  -1.775769 -0.621222 -1.949272
H  -0.899087 0.669744 -1.105732
H  -3.795907 1.206798 2.129465
H  -4.2731 -0.385974 1.525647
H  2.473865 -0.652075 -1.442233
H  1.127698 -2.77087 -0.747237
H  -0.596823 -3.112899 -1.04936
H  0.164745 -1.659414 -1.7647
H  -0.278816 -1.827297 2.565978
H  0.762588 -2.972089 1.674413
H  -1.008954 -3.158241 1.613307
H  2.437318 0.010521 1.578323
H  2.319151 -1.634155 0.881545
H  -3.300372 1.330647 -2.049939
H  1.849939 1.864353 -0.377178
H  2.849711 1.678085 -1.850849
H  4.396919 2.925421 -0.401181
H  3.869074 2.02018 1.049119
H  5.556077 0.967144 -1.318712
H  5.845759 0.69742 0.441224
H  -6.041994 1.301136 0.177074
H  -5.326585 2.255441 -1.157722
H  -5.116933 2.772545 0.544101
