program: Gaussian 09
title: 000251412
version: EM64L-G09RevD.01
frameworkgroup: C1[X(C9H14ClN3O2)]
method: RPBEPBE
basis: SDD
operation: Freq
keyword: #p
keyword: freq=noraman
keyword: PBEPBE/SDD
title: #p freq=noraman PBEPBE/SDD
converged: NO YES NO NO
title: Mulliken charges:
elementType: Cl O O N N N C C C C C C C C C H H H H H H H H H H H H H H
charge: -0.010830 -0.280395 -0.249463 -0.237594 -0.216638 -0.416034 0.526162 0.233985 -0.388312 -0.306398 0.299416 -0.437659 -0.667405 -0.678442 -0.612837 0.226418 0.277291 0.239577 0.248664 0.263433 0.204099 0.229988 0.323679 0.244775 0.235835 0.218787 0.253583 0.216706 0.259609
chargesum: 0.00000
title: Mulliken charges with hydrogens summed into heavy atoms:
elementType: Cl O O N N N C C C C C C C C C
charge: -0.010830 -0.280395 -0.249463 -0.237594 -0.216638 -0.092355 0.526162 0.233985 0.115397 0.181843 0.299416 -0.437659 0.030115 0.020955 0.117062
polarizability: 1.70994051e+02 5.06528999e+00 1.62422567e+02 3.21005989e+00 -2.09071340e+00 8.17380545e+01
1716.lowfreq: -15.3098 -12.0650 -0.0020 -0.0014 -0.0011 1.2408 40.0360 51.5293 68.0808
frequency: 39.8988 51.3116 68.0021 73.0686 82.1847 112.2972 164.3435 175.1597 188.6627 190.9067 213.8511 225.3824 250.2783 257.3022 327.7479 348.6898 358.0196 371.4620 378.5714 399.3890 445.1419 463.3863 506.0635 524.7873 612.0461 651.0302 699.2094 708.0073 728.5353 758.1523 799.5393 805.8640 851.2530 957.8984 984.3963 1012.3501 1056.5472 1079.2193 1084.6002 1095.6937 1117.4062 1145.8000 1180.5161 1192.0993 1209.8454 1224.5396 1294.4990 1312.5712 1343.5476 1344.1765 1374.1432 1387.4613 1389.8007 1393.2555 1442.5110 1443.9470 1461.5823 1465.8376 1470.6859 1472.2741 1482.0423 1482.1711 1487.2891 1527.6772 1573.2415 1617.6938 1635.1682 2981.1268 2991.9488 2992.7254 3021.6021 3043.8984 3067.6113 3077.6006 3089.8716 3093.5050 3094.5597 3106.6403 3111.7535 3119.6660 3580.1717
redmass: 3.4390 2.8885 4.4763 3.5706 3.9228 4.1075 5.1371 2.6457 1.0403 1.1913 1.2393 4.8930 5.2709 3.8564 5.9180 2.5110 3.6977 5.5881 3.8333 3.7178 6.1339 1.5280 3.8292 3.9529 6.9260 7.9337 10.4169 2.7432 8.8186 1.8558 1.9796 1.5922 2.9442 2.5477 2.7049 2.9840 2.8535 2.5178 2.0200 2.0199 1.2802 1.7728 3.8549 2.4983 4.2827 3.9182 1.5243 1.9554 1.5988 1.4865 1.7231 1.2516 1.4784 1.2646 1.1681 1.1139 1.0525 1.0643 1.0918 1.0459 1.0535 1.1423 1.0555 1.5499 8.8824 9.0050 8.0324 1.0388 1.0345 1.0353 1.0639 1.0599 1.0972 1.1025 1.0986 1.1012 1.0982 1.1016 1.1005 1.1059 1.0759
irintensity: 1.6225 0.7988 1.5416 0.7222 3.3642 1.8606 2.5513 0.7121 0.1946 0.8354 0.7193 0.6566 3.8290 1.5432 3.2986 21.7424 4.7726 17.2526 11.0048 17.0368 4.4899 81.1168 3.4074 16.3862 9.6680 3.0512 0.2908 9.7652 30.5476 6.5399 52.0088 3.6747 7.5974 10.0293 0.5689 36.5372 14.1728 2.8210 9.6211 14.8379 5.6219 17.0398 16.3566 24.2012 30.1554 48.8629 70.5799 15.4416 27.2713 20.8139 46.0207 14.4302 24.9093 42.4222 53.5330 45.8019 12.2118 23.4699 54.3566 11.6831 7.5112 23.2533 13.6562 182.9200 311.6555 544.9204 317.1716 22.0724 80.0055 13.6441 25.2612 13.9872 28.6260 24.5916 37.5145 11.4701 17.0637 11.4382 14.4217 7.5770 41.0496
temp: 298.150 k
press: 1.00000 atm
elementType: 17 8 8 7 7 7 6 6 6 6 6 6 6 6 6 1 1 1 1 1 1 1 1 1 1 1 1 1 1
symmnumber: 1
zpe: 603783.5 jmol-1
zpe.correction: 0.229969 hartree
zpe.thermalcorrener: 0.246377 hartree
zpe.thermalcorrenthalpy: 0.247321 hartree
zpe.thermalcorrgfe: 0.185577 hartree
zpe.sumelectzpe: -1124.985238 hartree
zpe.sumelectthermal: -1124.968831 hartree
zpe.sumelectthermalent: -1124.967886 hartree
zpe.sumelectthermalfe: -1125.029630 hartree
dipole: 4.8742 4.7419 -0.0099
dipole: 6.8002
quadrupole: -83.1410 -107.1505 -95.8022
quadrupole: 8.0674 -1.5595 1.3035
quadrupole: 12.2236 -11.7859 -0.4376 8.0674 -1.5595 1.3035
hfenergy: -1125.2152075 hartree
pointgroup: C01 [X(C9H14Cl1N3O2)]
dipole: -2.2504136 1.4465518 -0.0314586 debye
polarizability: 172.6252087|-2.9300228|160.8688577|2.8727277|0.85117|81.6606065 unknown
InChI: InChI=1S/C9H14ClN3O2/c1-4-12-7(11-3)6(10)8(14)13(5-2)9(12)15/h11H,4-5H2,1-3H3
charge 0 multiplicity 1
29 atoms
Cl -1.210495 -2.968041 -0.360286
O  1.394331 2.288999 0.323299
O  1.688924 -2.388102 0.270398
N  -0.589731 1.047952 0.208561
N  1.534128 -0.04933 0.351942
N  -2.640064 -0.122664 -0.018299
C  -1.260107 -0.192495 0.075185
C  0.829184 1.155466 0.28396
C  -1.334341 2.333787 0.308224
C  3.018055 0.028999 0.466536
C  0.94853 -1.362194 0.246314
C  -0.493668 -1.358576 0.067906
C  -1.682827 2.944644 -1.066221
C  3.700853 0.087273 -0.912959
C  -3.603827 -1.146206 0.421382
H  -2.231307 2.16791 0.931511
H  -0.667424 3.028007 0.843344
H  3.251674 0.930853 1.05494
H  3.335355 -0.87268 1.014489
H  -0.757394 3.150602 -1.629288
H  -2.318383 2.286565 -1.688622
H  -2.218829 3.900446 -0.925568
H  -3.034651 0.732326 -0.406426
H  3.464771 -0.814686 -1.502947
H  3.381924 0.983741 -1.472131
H  4.79731 0.135164 -0.783526
H  -3.845256 -1.879056 -0.367796
H  -4.530966 -0.632457 0.733034
H  -3.205771 -1.695947 1.288446
