program: Gaussian 09
title: 000251407
version: EM64L-G09RevD.01
frameworkgroup: C1[X(C8H12N2O3)]
method: RPBEPBE
basis: SDD
operation: Freq
keyword: #p
keyword: freq=noraman
keyword: PBEPBE/SDD
title: #p freq=noraman PBEPBE/SDD
converged: NO NO NO NO
title: Mulliken charges:
elementType: O O O N N C C C C C C C C H H H H H H H H H H H H
charge: -0.271038 -0.272514 -0.271662 -0.216538 -0.210722 0.426409 0.225154 -0.438696 0.209446 -0.602318 -0.602256 -0.237384 -0.679469 0.267553 0.277748 0.243849 0.243860 0.247441 0.247404 0.271998 0.227264 0.227242 0.218529 0.234387 0.234313
chargesum: 0.00000
title: Mulliken charges with hydrogens summed into heavy atoms:
elementType: O O O N N C C C C C C C C
charge: -0.271038 -0.272514 -0.271662 -0.216538 -0.210722 0.426409 0.225154 -0.171143 0.209446 0.163139 0.164587 0.217123 0.007760
polarizability: 1.48592247e+02 -4.40556738e+00 1.26397508e+02 -1.00833062e-02 3.10979696e-02 6.43341823e+01
1716.lowfreq: -8.5818 -0.0008 -0.0006 -0.0004 6.9136 12.5207 52.3241 91.8318 106.9957
frequency: 52.3036 91.8276 106.9923 114.7091 117.0909 125.6202 133.9100 188.5180 237.3266 250.5532 287.9133 305.0219 323.1865 342.8369 386.2618 394.4824 468.7731 503.8905 609.7926 638.3641 669.9889 676.7917 705.8051 723.8114 778.2571 827.9923 839.4444 898.9906 983.3342 1028.6520 1042.5695 1115.6347 1128.5451 1131.2976 1137.3592 1156.1930 1178.4454 1203.1863 1238.8637 1253.3095 1262.1831 1335.6416 1357.2092 1397.9764 1403.4443 1428.7615 1453.7676 1462.9927 1476.5290 1476.6481 1477.6538 1484.0618 1485.9409 1491.3717 1567.5704 1632.2785 1642.1488 2982.8086 3000.2826 3009.7672 3011.2119 3046.9955 3097.7846 3100.6389 3103.0682 3111.2922 3136.9389 3137.4345 3225.9604
redmass: 3.4559 2.6362 1.1350 3.0488 1.9153 3.5893 1.2016 6.1322 3.3610 1.3053 3.5770 5.1649 2.9840 3.3064 5.7971 7.6943 7.2032 7.3946 6.3174 4.5413 3.3076 5.0517 5.2162 6.2442 2.0327 1.1081 3.5644 3.3256 2.1160 2.7210 2.9736 2.1626 1.2908 1.3084 1.4389 5.0931 2.6769 2.8950 3.2061 2.6552 1.1371 3.6795 1.3596 1.4429 1.3025 1.2908 1.7528 1.0396 1.0439 1.0565 1.0655 1.0508 1.1048 1.2339 9.0689 9.7554 8.4069 1.0556 1.0367 1.0329 1.0332 1.1084 1.0987 1.1021 1.1027 1.1021 1.1016 1.1021 1.0924
irintensity: 0.2698 0.1877 0.6905 5.9030 4.0026 1.7955 2.4948 2.5841 3.9550 0.0869 0.3715 0.3192 8.7235 0.5564 4.7865 28.2933 13.0018 24.4534 7.1160 1.2497 7.6274 6.3107 2.7103 8.1038 63.2665 0.0079 7.2012 38.5605 26.9117 26.3146 21.7144 1.2559 0.3614 0.0184 5.7603 257.3847 107.9389 29.2086 15.2042 2.8280 0.0324 56.3786 66.9024 37.7631 16.3250 120.7538 169.3291 13.1370 18.4795 14.1446 13.6658 23.2802 49.1471 132.8798 114.0306 447.9679 563.2983 20.0963 16.4883 33.2591 30.5206 17.8842 21.7110 17.1969 20.4732 32.8136 0.1204 0.8662 2.7357
temp: 298.150 k
press: 1.00000 atm
elementType: 8 8 8 7 7 6 6 6 6 6 6 6 6 1 1 1 1 1 1 1 1 1 1 1 1
symmnumber: 1
zpe: 521561.1 jmol-1
zpe.correction: 0.198652 hartree
zpe.thermalcorrener: 0.212256 hartree
zpe.thermalcorrenthalpy: 0.213200 hartree
zpe.thermalcorrgfe: 0.158463 hartree
zpe.sumelectzpe: -646.251515 hartree
zpe.sumelectthermal: -646.237911 hartree
zpe.sumelectthermalent: -646.236966 hartree
zpe.sumelectthermalfe: -646.291703 hartree
dipole: -5.6595 0.8849 -0.0023
dipole: 5.7283
quadrupole: -67.3878 -88.9171 -76.4095
quadrupole: 3.6097 -0.0066 0.0013
quadrupole: 10.1836 -11.3456 1.1620 3.6097 -0.0066 0.0013
hfenergy: -646.4501667 hartree
pointgroup: C01 [X(C8H12N2O3)]
dipole: 2.2256022 0.348959 0.0634245 debye
dipolederiv: -1.9417908 0.07303 -0.0530017 0.1080471 -0.4255201 0.0061248 -0.0533682 0.0047286 -0.2685952 -0.8034813 0.3896977 -0.0201271 0.3454366 -1.0580692 0.0229595 -0.0199669 0.0243351 -0.3732302 -0.7785135 -0.3804662 -0.0059015 -0.3420192 -1.1826995 0.0039612 -0.0068106 0.0022936 -0.3668095 -1.1944116 0.512956 -0.0402507 0.0032329 -0.9903339 0.0156372 -0.0332795 0.027814 -0.1756245 -0.6970767 0.0667179 -0.0165468 0.0951734 -1.3141996 0.0228546 -0.0168287 0.0220409 -0.2001279 1.6852481 -0.2263849 0.0494874 0.3977076 1.2994429 -0.0071686 0.0386642 -0.025486 0.2066866 1.507665 -0.3524698 0.0447404 -0.140797 1.4749452 -0.0263612 0.041086 -0.0329859 0.2709568 -0.9450963 -0.4135573 -0.0116257 -0.428485 -0.614245 -0.007989 -0.0112602 -0.0073452 -0.3293157 1.4060621 0.3098126 0.0307661 0.0441926 1.6223762 -0.0230685 0.0356273 -0.0148398 0.2294025 0.1018635 0.1541988 -0.0069881 0.2226114 0.4052719 0.0012141 -0.006889 -0.0002114 0.2136528 0.4034015 0.0130268 0.005832 0.081174 0.0398907 0.0054196 0.0047665 0.0033991 0.2055931 0.9557168 -0.1533678 0.0209174 -0.5582326 0.3319509 -0.0166936 0.0283477 -0.0040463 0.3674619 -0.1614504 -0.0299908 -0.0060851 0.0073881 0.0430916 0.0006151 -0.0065419 -0.0005976 0.054736 0.0233483 0.041108 -0.0060337 0.0794918 0.0450802 0.0050856 -0.0067506 0.0038375 0.1973961 0.1012556 0.1505116 -0.0013899 0.0248337 0.0724566 0.0011667 0.0000582 0.0053613 0.1310643 0.0232183 -0.094315 0.0960924 -0.0456949 0.0488813 -0.025426 0.1042697 0.0315735 -0.0431066 0.0320324 -0.0951383 -0.0901026 -0.0488377 0.0516596 0.0210096 -0.0987163 -0.0367369 -0.0494525 0.008042 0.00263 -0.023401 0.0653944 0.0849272 0.0910772 -0.073043 0.0528952 -0.0499426 0.0021332 0.0069179 0.0261975 0.0737209 0.0795536 -0.0915757 0.0734146 -0.057259 -0.0385198 0.160868 0.0113014 0.0007599 -0.13814 0.0097456 -0.0019199 0.0034201 0.0025741 0.1278188 -0.0215555 -0.033188 0.0683861 0.0873062 -0.0235438 0.0778811 0.0286962 0.0911854 -0.0617089 -0.015659 -0.0296983 -0.0645094 0.0910813 -0.0295898 -0.0736292 -0.0291845 -0.0944506 -0.0617378 -0.0482564 0.0922176 -0.0067609 0.1267237 -0.0337429 0.0063875 -0.0073776 0.0053303 0.120817 0.0974543 -0.0108981 0.004116 -0.0782687 0.0347689 0.0988412 0.0363049 0.1014597 -0.0561481 0.0989823 -0.0046516 0.0054291 -0.0730407 0.0279015 -0.1064033 -0.0246382 -0.1048696 -0.0512667 unknown
polarizability: 148.5141753|4.4459135|126.3800637|2.5101263|-0.998143|64.4296985 unknown
InChI: InChI=1S/C8H12N2O3/c1-4-13-7-5-6(11)9(2)8(12)10(7)3/h5H,4H2,1-3H3
charge 0 multiplicity 1
25 atoms
O  2.152353 0.283478 0.143754
O  -2.126757 2.086816 -0.020341
O  -1.772284 -2.59504 0.073529
N  0.015577 1.128194 0.063928
N  -1.950228 -0.245032 0.027278
C  0.803747 -0.018513 0.107866
C  -1.409009 1.046855 0.02083
C  0.252915 -1.286822 0.113169
C  -1.18305 -1.472413 0.07241
C  0.6320 2.473195 0.057858
C  -3.426076 -0.338413 -0.016046
C  3.113367 -0.854021 0.194316
C  4.510415 -0.245983 0.227175
H  0.863256 -2.187347 0.147254
H  -0.191386 3.201646 0.031825
H  1.276124 2.598052 -0.827917
H  1.241987 2.620563 0.963784
H  -3.810949 0.14169 -0.930829
H  -3.86539 0.174909 0.855161
H  -3.681274 -1.408114 -0.003843
H  2.900659 -1.452981 1.100889
H  2.957308 -1.485201 -0.701861
H  5.263919 -1.053399 0.263372
H  4.696089 0.362951 -0.673507
H  4.641489 0.39233 1.117046
