program: Gaussian 09
title: 000251396
version: EM64L-G09RevD.01
frameworkgroup: C1[X(C8H9N5)]
method: RPBEPBE
basis: SDD
operation: Freq
keyword: #p
keyword: freq=noraman
keyword: PBEPBE/SDD
title: #p freq=noraman PBEPBE/SDD
converged: YES YES NO NO
title: Mulliken charges:
elementType: N N N N N C C C C C C C C H H H H H H H H H
charge: -0.012097 -0.092229 -0.161828 -0.373523 -0.573357 0.231988 -0.108940 0.098906 0.115811 -0.273049 -0.744384 -0.183112 -0.364574 0.317026 0.236199 0.243306 0.236244 0.230850 0.243712 0.319624 0.306890 0.306538
chargesum: 0.00000
title: Mulliken charges with hydrogens summed into heavy atoms:
elementType: N N N N N C C C C C C C C
charge: -0.012097 -0.092229 -0.161828 -0.053899 0.040071 0.231988 -0.108940 0.098906 0.115811 0.043978 -0.028636 0.047738 -0.120862
polarizability: 1.63820204e+02 -1.99112300e+00 1.53498563e+02 -6.85429922e-02 1.22218513e-02 5.73345658e+01
1716.lowfreq: -7.6490 -3.3920 0.0000 0.0001 0.0006 4.3613 41.0349 92.0489 114.3199
frequency: 40.9846 92.0429 114.3197 122.8886 186.2709 220.1803 253.5794 322.3575 359.9880 363.3647 425.2291 446.3347 473.0521 479.2633 522.7632 582.9656 608.3112 647.2021 665.2610 673.0021 682.7416 754.7748 806.8215 811.4248 833.1982 961.9265 965.5363 1017.8141 1024.4774 1042.3604 1042.9650 1074.2154 1098.9689 1142.3955 1218.0803 1230.8705 1245.3936 1250.7965 1322.2966 1357.7889 1380.1532 1391.2082 1414.2386 1451.9428 1452.8625 1462.0308 1493.9050 1512.2286 1540.4960 1583.8285 1673.8812 2993.8202 3073.4241 3118.6187 3121.3071 3155.8794 3180.5611 3421.1800 3437.5219 3544.7351
redmass: 3.4558 2.8181 4.0352 1.2609 4.3183 4.4795 3.0131 1.9787 1.7524 4.7250 4.9494 4.2824 4.6389 7.3368 6.9856 2.7997 3.4844 1.1304 2.4604 3.8764 6.5200 7.0779 2.2334 6.7236 2.0994 1.4285 2.0477 4.5652 1.3206 2.7717 1.5150 3.7175 4.6886 1.5953 2.2376 5.1452 1.1593 2.5943 6.0584 2.9311 2.1045 1.3082 2.0760 1.0468 3.4320 1.2342 2.7288 3.8671 4.4734 6.3736 1.1416 1.0363 1.0967 1.1003 1.0898 1.0927 1.0973 1.0415 1.0745 1.1040
irintensity: 5.9326 1.0484 2.4173 0.0329 4.5710 5.3503 7.2678 19.0441 36.3884 2.4675 4.7875 2.3117 1.6570 4.2703 1.8194 51.1384 7.6371 79.0828 136.8057 61.2991 13.1909 9.2514 43.2316 15.6444 20.9922 0.0077 1.4292 7.8273 2.8838 5.5148 2.2451 18.1604 6.0209 5.0773 45.0364 59.5267 0.4118 12.6463 26.3126 44.0770 6.7203 16.4104 61.4558 15.0360 26.1637 21.2563 78.5682 31.8229 54.1399 39.5807 37.6951 20.0998 15.4373 13.7993 19.7318 16.4605 17.1471 1.1173 31.6126 3.9845
temp: 298.150 k
press: 1.00000 atm
elementType: 7 7 7 7 7 6 6 6 6 6 6 6 6 1 1 1 1 1 1 1 1 1
symmnumber: 1
zpe: 441948.6 jmol-1
zpe.correction: 0.168329 hartree
zpe.thermalcorrener: 0.179666 hartree
zpe.thermalcorrenthalpy: 0.180610 hartree
zpe.thermalcorrgfe: 0.130781 hartree
zpe.sumelectzpe: -583.015488 hartree
zpe.sumelectthermal: -583.004152 hartree
zpe.sumelectthermalent: -583.003208 hartree
zpe.sumelectthermalfe: -583.053037 hartree
dipole: 5.1209 4.2756 0.0150
dipole: 6.6712
quadrupole: -55.7972 -80.4234 -75.8867
quadrupole: -0.7561 0.0658 -0.0171
quadrupole: 14.9052 -9.7210 -5.1843 -0.7561 0.0658 -0.0171
hfenergy: -583.1838174 hartree
pointgroup: C01 [X(C8H9N5)]
dipole: 0.84479 -2.4656883 -0.3090108 debye
dipolederiv: -0.3902469 -0.1166735 -0.0375862 -0.1193796 -0.4868792 -0.0555811 -0.0386088 -0.0561453 -0.2435585 0.2916601 0.2601765 0.1054483 -0.4140795 -0.0283835 -0.0126643 -0.0042434 0.0655152 -0.2368087 -0.41716 -0.1682838 -0.0440617 0.9528889 -0.5074873 0.073051 0.1386934 -0.0580565 -0.2650846 -0.8182593 0.3820092 0.0186535 0.5733243 -0.1652363 0.1205831 0.0360613 0.1066078 -0.456071 -0.6426929 -0.0542278 -0.0857313 -0.3353475 -0.0534454 -0.0483392 -0.1263212 -0.021267 0.0023387 -0.2870498 0.3001603 0.0061339 -0.2754023 -0.1323086 -0.0653763 -0.0879137 0.0030348 0.062732 0.0673296 0.0743249 0.0092163 0.4526409 0.2333195 0.0753247 0.0710121 0.0313958 0.1082049 0.0615988 -0.4421162 -0.0695744 -0.4097856 0.1305242 -0.0332172 -0.0641613 -0.0367653 0.0276825 1.244488 -0.5801696 0.0273559 -0.8894119 0.4028753 -0.0759453 -0.019174 -0.039925 0.2024926 0.1193657 -0.1172919 0.0078415 0.1980115 0.0292385 0.0447962 0.0577717 0.0080776 -0.0969234 -0.1759467 0.2015537 0.0063237 0.0780539 -0.0033124 0.000044 -0.0141479 0.0145748 0.052851 -0.4240852 0.0882354 -0.0201949 0.0486026 0.0476355 0.0341557 -0.0267597 0.0387816 -0.1273446 0.4742795 0.0570569 0.0718519 -0.077733 0.2855267 0.0460929 0.0503456 0.0620981 -0.0398 0.1560216 0.0613896 0.0107963 0.0347667 0.0567569 -0.0096924 0.0066668 -0.0064045 0.1419685 -0.0109703 0.0266737 0.0980339 -0.0144767 0.0665005 0.063301 0.1156644 0.0134363 -0.0004147 0.0861977 -0.1199378 -0.0228951 -0.0089507 -0.0884763 -0.0342238 -0.0047118 -0.0472432 0.1057756 0.035158 0.0540119 -0.0740327 0.0328752 0.0798274 -0.0256705 -0.1018198 0.0313753 -0.0599518 0.0802775 -0.0364487 -0.0157392 -0.0561106 -0.1039156 -0.0497756 -0.0190166 -0.0475684 0.1546336 -0.104858 -0.0921377 -0.0421484 -0.0704733 0.0496396 -0.0207137 -0.0385945 -0.023118 0.1180278 0.1994265 -0.0051051 -0.0162354 0.0110842 0.0154125 -0.0527246 -0.0096155 -0.0555786 0.3283877 0.2467543 0.127067 -0.0632721 0.1546537 0.0862947 0.0035344 -0.0213107 0.0280031 0.0946678 0.2087117 0.0997331 0.1298161 0.1342489 0.0858929 0.023041 0.1001837 -0.0108286 0.1261945 unknown
polarizability: 161.4290072|-5.5083089|152.1822425|11.2433807|14.7589625|61.0420828 unknown
InChI: InChI=1S/C8H9N5/c1-5-7-6(3-2-4-10-7)8(11-9)13-12-5/h2-4,11H,9H2,1H3
charge 0 multiplicity 1
22 atoms
N  -2.207488 -0.005243 -0.209241
N  0.572576 2.308007 0.491697
N  1.666761 1.457972 0.48058
N  2.743553 -0.537842 0.287091
N  2.945212 -1.910623 0.073693
C  0.218534 -0.487767 -0.001995
C  -0.905856 0.419236 0.012628
C  -0.675068 1.82305 0.26758
C  1.514485 0.11844 0.247373
C  -0.041176 -1.871065 -0.255198
C  -1.807689 2.816911 0.297808
C  -1.358935 -2.286679 -0.476991
C  -2.407363 -1.318217 -0.444781
H  0.8021 -2.564764 -0.268389
H  -2.551339 2.546888 1.068744
H  -1.400198 3.817885 0.50942
H  -2.348927 2.831256 -0.665111
H  -1.594457 -3.33729 -0.673845
H  -3.447255 -1.622154 -0.616869
H  3.530901 0.094865 0.48035
H  3.279057 -2.413211 0.903322
H  3.466771 -2.124756 -0.783566
