program: Gaussian 09
title: 000251424
version: EM64L-G09RevD.01
frameworkgroup: C1[X(C22H20FN3O2)]
method: RPBEPBE
basis: SDD
operation: Freq
keyword: #p
keyword: freq=noraman
keyword: PBEPBE/SDD
title: #p freq=noraman PBEPBE/SDD
converged: YES YES NO NO
title: Mulliken charges:
elementType: F O O N N N C C C C C C C C C C C C C C C C C C C C C C H H H H H H H H H H H H H H H H H H H H
charge: -0.167720 -0.164337 -0.184954 -0.243953 -0.245165 -0.005020 0.289075 0.038113 -0.484438 -0.479435 -0.420558 -0.430091 -0.389283 0.097854 0.084134 -0.216487 0.466039 0.465568 -0.371184 -0.376356 -0.350263 -0.346103 -0.210662 -0.209994 -0.204672 -0.202997 -0.244932 -0.243443 0.242746 0.214072 0.263855 0.244887 0.237076 0.206907 0.208671 0.236631 0.191527 0.210683 0.282982 0.273328 0.261954 0.266039 0.235826 0.234209 0.233491 0.234885 0.235737 0.235758
chargesum: 0.00000
title: Mulliken charges with hydrogens summed into heavy atoms:
elementType: F O O N N N C C C C C C C C C C C C C C C C C C C C C C
charge: -0.167720 -0.164337 -0.184954 -0.243953 -0.245165 -0.005020 0.289075 0.038113 -0.027621 0.029307 0.023426 0.015210 0.012927 0.097854 0.084134 -0.216487 0.466039 0.465568 -0.088201 -0.103028 -0.088309 -0.080064 0.025164 0.024215 0.028819 0.031888 -0.009196 -0.007685
polarizability: 3.12567807e+02 2.04829326e+00 2.61893411e+02 1.73910827e+01 -2.36995655e+01 1.97023656e+02
1716.lowfreq: -0.0003 0.0003 0.0005 4.1606 9.0182 14.7823 27.2627 35.0935 49.1285
frequency: 26.8954 32.8388 48.8538 53.8373 58.8495 63.3848 77.4216 88.9215 111.7671 134.3670 139.7418 149.1700 184.8869 210.0840 217.6603 221.8062 243.4488 257.8684 262.1807 272.0441 304.2080 309.7436 328.4725 360.0591 383.2589 392.6939 401.4122 405.2920 406.5699 429.1303 440.0410 498.6082 502.0434 508.6347 519.2271 569.0307 605.4531 611.8396 614.2951 630.1769 637.9476 657.6894 680.7496 691.4736 693.2158 742.5112 751.4748 772.0553 785.8432 792.5666 824.4236 833.9785 838.3200 839.2581 854.5473 886.2553 908.5456 915.4062 915.6763 934.6610 943.8850 972.3148 973.1952 974.7243 987.4571 988.4125 995.8514 996.1017 1008.8126 1023.7069 1028.8598 1032.8446 1059.1963 1063.4291 1070.4878 1088.9895 1093.2664 1108.8497 1124.6307 1146.4111 1149.7028 1173.8386 1175.8868 1175.9433 1188.8764 1190.0863 1192.4926 1231.4479 1264.3079 1280.7494 1286.1483 1290.0467 1302.6007 1322.5894 1327.3555 1340.5613 1341.9366 1348.5854 1350.5843 1360.9710 1383.9488 1386.9746 1443.9439 1449.3604 1461.2452 1464.8139 1467.6601 1477.2578 1479.4360 1481.3880 1483.1779 1593.4016 1595.3554 1603.5651 1607.1136 1630.2831 1662.3921 2187.8671 2971.6023 2975.3919 2987.9118 2989.0979 3017.9504 3039.1942 3041.7054 3047.2660 3055.2233 3084.9136 3136.7087 3136.9051 3147.6603 3147.7648 3162.3710 3162.7398 3173.4711 3173.5477 3188.3996 3190.4215
redmass: 6.1717 5.5867 6.0157 3.9963 4.6369 4.1962 6.3913 6.1347 5.0956 7.9455 4.4637 5.0513 4.9655 5.6317 6.1338 5.7414 3.6552 3.0764 4.8247 6.4196 3.9458 5.0842 6.8154 4.6710 3.2468 4.0829 6.2082 2.9881 2.9246 5.2770 4.3717 3.4323 2.5417 2.3152 8.7352 5.1587 7.6489 6.4778 6.6983 7.4200 4.5526 6.7158 8.1727 2.2586 2.3132 1.9976 2.4388 2.7424 2.9788 1.6638 2.2289 2.1278 1.2864 1.3290 7.4238 3.0112 2.6453 1.4453 1.3818 1.5525 2.2513 1.4108 1.3768 3.3969 5.9518 5.5898 1.3160 1.3223 4.6281 2.6047 2.3328 3.3743 1.9201 2.1512 2.5800 1.6696 2.4240 1.8593 3.4578 1.7087 2.8013 2.7859 1.0501 1.0559 1.2718 1.1466 1.4739 5.3304 1.3536 1.2432 5.0401 1.5325 2.4280 1.3345 1.2833 1.7611 1.4080 1.4422 1.3887 1.4359 9.1349 10.5053 2.3133 2.3665 1.0869 1.0862 1.0823 1.0811 2.3129 2.2834 1.0888 6.4505 6.6763 6.1770 6.0252 11.9420 12.4710 12.6432 1.0637 1.0603 1.0620 1.0621 1.0626 1.0960 1.0989 1.1012 1.1035 1.1035 1.0855 1.0855 1.0898 1.0898 1.0944 1.0943 1.0986 1.0986 1.0970 1.0967
irintensity: 0.3494 1.2651 2.8981 0.4326 0.2502 0.1932 0.6328 0.3562 0.2161 4.2289 0.6076 1.6021 1.7768 0.7663 9.0073 3.7333 3.1625 1.1604 0.8384 1.6746 8.0692 6.7379 3.4003 0.6470 2.3079 1.7227 0.7762 0.2648 1.2150 9.5649 3.6792 3.7526 8.5239 8.6625 8.8801 0.0824 22.9347 1.1826 8.3726 9.5319 2.1033 1.2196 6.5420 35.4019 19.8058 85.9275 73.4912 2.5591 27.5775 2.4100 0.7525 9.2297 1.0641 1.2092 0.4263 3.0330 12.2969 4.3886 1.7082 6.4311 2.4984 1.2345 0.1269 33.4981 1.0039 1.4116 0.1734 0.3447 28.6835 5.2270 25.9390 14.2676 1.0840 3.7469 0.8156 13.0948 23.4342 1.1499 25.4807 8.0204 12.4900 3.5587 0.0607 0.1286 2.2727 3.8570 22.2045 45.7313 15.1112 17.2526 327.6568 0.2594 10.4606 1.8966 0.4774 3.5257 1.6323 0.1328 13.8568 0.4789 1.9557 1.3279 8.0724 14.4285 4.9800 7.3293 9.2352 20.5923 51.0445 90.2151 7.4726 5.2276 7.5886 7.7587 52.3819 197.9561 331.8306 2.0282 32.8634 35.2898 26.1303 22.6826 4.1121 60.1087 35.6830 8.0171 52.7410 10.6177 0.2931 0.1736 10.0856 10.0830 29.3479 21.5442 6.9475 13.1737 1.3203 1.0040
temp: 298.150 k
press: 1.00000 atm
elementType: 9 8 8 7 7 7 6 6 6 6 6 6 6 6 6 6 6 6 6 6 6 6 6 6 6 6 6 6 1 1 1 1 1 1 1 1 1 1 1 1 1 1 1 1 1 1 1 1
symmnumber: 1
zpe: 979133.8 jmol-1
zpe.correction: 0.372932 hartree
zpe.thermalcorrener: 0.397129 hartree
zpe.thermalcorrenthalpy: 0.398073 hartree
zpe.thermalcorrgfe: 0.318732 hartree
zpe.sumelectzpe: -1262.861827 hartree
zpe.sumelectthermal: -1262.837631 hartree
zpe.sumelectthermalent: -1262.836687 hartree
zpe.sumelectthermalfe: -1262.916027 hartree
dipole: 6.0930 -1.6727 5.0623
dipole: 8.0963
quadrupole: -151.5731 -166.4440 -162.7021
quadrupole: 12.4605 -13.3656 1.7432
quadrupole: 8.6666 -6.2043 -2.4623 12.4605 -13.3656 1.7432
hfenergy: -1263.2347595 hartree
pointgroup: C01 [X(C22H20F1N3O2)]
dipole: 2.5318877 -0.5208268 1.8613471 debye
polarizability: 313.7484874|3.8978459|262.6060651|12.8503568|-22.4186544|195.1303213 unknown
InChI: InChI=1S/C22H20FN3O2/c23-22(21(16-24)14-8-3-9-15-21)19(27)25(17-10-4-1-5-11-17)26(20(22)28)18-12-6-2-7-13-18/h1-2,4-7,10-13H,3,8-9,14-15H2
charge 0 multiplicity 1
48 atoms
F  -1.701795 -0.784533 -2.149114
O  -1.017296 2.114321 -1.203865
O  -0.61045 -2.58744 0.003394
N  0.707493 0.683434 -0.445295
N  0.823647 -0.713895 -0.080216
N  -4.389647 1.598842 -1.190362
C  -2.76387 -0.172996 -0.017884
C  -1.418589 -0.329194 -0.784185
C  -2.476189 0.286147 1.455234
C  -3.558768 -1.529027 -0.006413
C  -3.772488 0.375993 2.292241
C  -4.848621 -1.423816 0.837682
C  -4.549775 -0.961208 2.283592
C  -0.597936 0.979215 -0.881174
C  -0.415642 -1.366399 -0.208185
C  -3.610121 0.842379 -0.698279
C  1.647024 1.651897 0.055731
C  2.10374 -1.376911 -0.131746
C  1.851112 2.84384 -0.682408
C  2.325807 -2.494744 0.708228
C  2.330119 1.431358 1.277614
C  3.105748 -0.933739 -1.029483
C  2.739182 3.819572 -0.181747
C  3.56091 -3.174225 0.637566
C  3.226038 2.41037 1.754808
C  4.339934 -1.614404 -1.075883
C  3.433464 3.607652 1.031571
C  4.573113 -2.736099 -0.246724
H  -1.958684 1.263735 1.455013
H  -1.799281 -0.461346 1.917127
H  -2.896713 -2.309923 0.408223
H  -3.793465 -1.818796 -1.045252
H  -4.414432 1.182687 1.887755
H  -3.51027 0.663512 3.328034
H  -5.344998 -2.412507 0.847786
H  -5.554526 -0.716449 0.360257
H  -3.950281 -1.738271 2.801636
H  -5.49341 -0.851206 2.850332
H  1.310101 3.007703 -1.616934
H  1.539588 -2.834955 1.385959
H  2.165899 0.511609 1.845936
H  2.922655 -0.075991 -1.682758
H  2.890269 4.744868 -0.747515
H  3.730607 -4.045183 1.279288
H  3.758078 2.237411 2.696347
H  5.116269 -1.271012 -1.767749
H  4.127839 4.365657 1.40889
H  5.532011 -3.263034 -0.291071
