program: Gaussian 09
title: 000251361
version: EM64L-G09RevD.01
frameworkgroup: C1[X(C18H13NS)]
method: RPBEPBE
basis: SDD
operation: Freq
keyword: #p
keyword: freq=noraman
keyword: PBEPBE/SDD
title: #p freq=noraman PBEPBE/SDD
converged: NO NO NO NO
title: Mulliken charges:
elementType: S N C C C C C C C C C C C C C C C C C C H H H H H H H H H H H H H
charge: 0.293365 -0.046092 -0.216924 0.436220 0.205535 -0.098142 0.600648 -0.408458 -0.430978 -0.327101 -0.297252 -0.594952 0.437397 -0.325483 -0.339880 -0.420999 -0.270492 -0.234963 -0.239033 -0.812881 0.247311 0.244008 0.226971 0.238780 0.266117 0.235207 0.239929 0.244117 0.226762 0.228699 0.233031 0.233069 0.226463
chargesum: 0.00000
title: Mulliken charges with hydrogens summed into heavy atoms:
elementType: S N C C C C C C C C C C C C C C C C C C
charge: 0.293365 -0.046092 -0.216924 0.436220 0.205535 -0.098142 0.600648 -0.408458 -0.183666 -0.083093 -0.070281 -0.356172 0.437397 -0.059366 -0.104674 -0.181071 -0.026375 -0.008201 -0.010334 -0.120317
polarizability: 4.96109724e+02 1.78888617e+01 2.12898782e+02 1.19822195e-04 5.58924261e-03 8.51257904e+01
1716.lowfreq: -0.0009 0.0017 0.0020 4.2041 7.5253 15.1429 33.8646 47.0627 65.7578
frequency: 33.8469 47.0621 65.7558 90.3051 109.3892 169.0950 184.0368 194.8805 211.3861 215.8953 275.0931 312.4659 357.8750 379.0611 399.1949 438.3667 459.0224 466.2762 479.5558 485.9979 496.2854 531.4823 558.3812 575.0851 586.3806 626.8851 656.5188 687.2290 696.2863 722.1353 738.1094 758.6396 776.6669 798.1051 821.4201 846.2602 847.0211 848.1036 880.1638 883.3266 899.3159 936.0618 947.6928 971.6224 978.0908 983.2332 984.7226 1005.7799 1017.4884 1049.0283 1049.4723 1121.2605 1129.3256 1146.5542 1171.8478 1182.2320 1196.3185 1242.0147 1253.9560 1259.8870 1276.2200 1294.1674 1317.2945 1363.9338 1385.4025 1393.0493 1399.8932 1408.5463 1430.1455 1452.0842 1463.6818 1469.5217 1478.3872 1495.0338 1540.5867 1549.1432 1574.4967 1591.9385 1601.4477 1633.5519 2971.8231 3048.4100 3081.5882 3111.8252 3124.7978 3125.4109 3128.1846 3134.1128 3147.4340 3163.3989 3163.6550 3164.0881 3169.8950
redmass: 5.7103 4.4020 5.7048 3.5517 1.1584 3.7351 4.7610 4.9396 6.7902 4.7450 4.6394 3.7959 4.1181 5.3645 3.4619 3.0842 6.3346 5.0002 8.0500 3.1580 4.7560 6.6886 3.1246 6.4013 3.0526 7.7344 6.3446 7.0385 3.0680 5.8937 2.4703 1.4552 5.8881 2.7164 1.5103 1.4094 5.3047 1.5391 1.5924 4.7294 1.5724 3.4329 1.3990 4.2525 1.3605 1.3276 1.3480 1.5365 2.4098 1.5627 4.3800 1.7418 1.5248 1.3091 1.0951 1.3985 1.2827 2.0855 1.8189 2.2849 2.6607 3.1605 2.4823 4.6670 2.7272 4.7776 1.2504 5.7586 2.5761 2.7746 1.7151 1.0455 2.4050 2.3558 6.7868 6.3684 6.5077 6.4782 6.6507 6.5088 1.0375 1.0973 1.0987 1.0917 1.0891 1.0854 1.0893 1.0891 1.0953 1.0967 1.0991 1.0968 1.0941
irintensity: 0.6613 0.7727 0.9320 0.0059 0.8532 3.2307 0.9676 0.4709 0.0739 0.6346 0.0453 1.3302 4.1958 1.8012 2.0951 14.2943 0.9055 7.5188 0.8062 3.3413 2.1348 1.3264 0.2520 4.8877 10.3999 4.0937 2.9333 1.1755 0.7011 2.7019 29.6904 47.6423 1.1225 0.2453 1.8679 90.9539 1.4425 5.0218 20.3522 5.1674 17.5659 1.5393 5.4206 9.4913 0.0000 0.1081 2.7042 10.9079 4.8476 13.0873 2.0125 15.1559 3.2252 6.6943 6.1760 3.2368 42.2921 0.5379 4.9711 1.7117 3.1040 19.2875 3.7065 32.4688 1.9293 8.0305 6.3956 9.4332 4.8149 0.5289 22.7440 13.5892 5.3372 30.0489 83.8727 9.4409 3.6004 88.6805 2.9282 14.2789 47.6382 19.4030 17.3470 26.0051 20.6054 0.9454 11.8296 2.0065 24.6135 28.7720 31.6447 4.7729 12.9012
temp: 298.150 k
press: 1.00000 atm
elementType: 16 7 6 6 6 6 6 6 6 6 6 6 6 6 6 6 6 6 6 6 1 1 1 1 1 1 1 1 1 1 1 1 1
symmnumber: 1
zpe: 663258.1 jmol-1
zpe.correction: 0.252622 hartree
zpe.thermalcorrener: 0.268421 hartree
zpe.thermalcorrenthalpy: 0.269365 hartree
zpe.thermalcorrgfe: 0.208770 hartree
zpe.sumelectzpe: -1145.204068 hartree
zpe.sumelectthermal: -1145.188269 hartree
zpe.sumelectthermalent: -1145.187325 hartree
zpe.sumelectthermalfe: -1145.247919 hartree
dipole: -1.8422 2.2274 0.0009
dipole: 2.8906
quadrupole: -91.5523 -108.0696 -131.4203
quadrupole: 0.1843 -0.0008 -0.0003
quadrupole: 18.7951 2.2778 -21.0729 0.1843 -0.0008 -0.0003
hfenergy: -1145.4566896 hartree
pointgroup: C01 [X(C18H13N1S1)]
dipole: 0.7138087 0.8849282 -0.0259545 debye
polarizability: 496.5041801|-14.3939992|212.4169725|-1.3747568|-3.1911508|85.213143 unknown
InChI: InChI=1S/C18H13NS/c1-12-6-8-15-13(10-12)7-9-16(19-15)18-11-14-4-2-3-5-17(14)20-18/h2-11H,1H3
charge 0 multiplicity 1
33 atoms
S  -1.830144 -1.479764 0.07557
N  1.006512 -0.654156 0.042546
C  -1.222846 0.23646 0.029187
C  3.018853 0.800992 -0.0036
C  0.225949 0.454249 0.017776
C  2.381661 -0.497602 0.032351
C  -3.578097 0.572127 0.029741
C  -3.529463 -0.862779 0.066554
C  -2.256956 1.163094 0.009481
C  2.16138 1.952095 -0.028962
C  0.78047 1.787984 -0.01851
C  4.447799 0.884741 -0.012218
C  5.243804 -0.267205 0.013467
C  3.204945 -1.669727 0.058483
C  4.594382 -1.553085 0.049136
C  -4.844664 1.221096 0.017922
C  -4.707522 -1.639953 0.091281
C  -6.019422 0.44782 0.042475
C  -5.951897 -0.974859 0.07907
C  6.75902 -0.195338 0.004913
H  -2.10229 2.244835 -0.018678
H  2.605795 2.954125 -0.056474
H  0.114388 2.6550 -0.037446
H  4.917902 1.876446 -0.039655
H  2.702323 -2.641469 0.08567
H  5.219102 -2.454839 0.069332
H  -4.896177 2.315611 -0.010072
H  -4.6620 -2.734099 0.119215
H  -6.998446 0.939543 0.033583
H  -6.87783 -1.560501 0.097876
H  7.187716 -0.677838 0.904237
H  7.179725 -0.720944 -0.873798
H  7.119325 0.84764 -0.021957
