program: Gaussian 09
title: 000251363
version: EM64L-G09RevD.01
frameworkgroup: C1[X(C18H13NS)]
method: RPBEPBE
basis: SDD
operation: Freq
keyword: #p
keyword: freq=noraman
keyword: PBEPBE/SDD
title: #p freq=noraman PBEPBE/SDD
converged: NO NO NO NO
title: Mulliken charges:
elementType: S N C C C C C C C C C C C C C C C C C C H H H H H H H H H H H H H
charge: 0.283535 -0.042434 -0.254715 -0.229126 0.229701 0.456093 0.601530 0.413968 -0.406215 -0.429665 -0.302681 -0.322565 -0.428759 -0.426407 -0.420804 -0.243672 -0.271701 -0.796256 -0.234793 -0.238578 0.247664 0.228462 0.243208 0.236408 0.237025 0.240350 0.228649 0.244191 0.246175 0.246617 0.208441 0.227259 0.229091
chargesum: 0.00000
title: Mulliken charges with hydrogens summed into heavy atoms:
elementType: S N C C C C C C C C C C C C C C C C C C
charge: 0.283535 -0.042434 -0.254715 -0.229126 0.229701 0.456093 0.601530 0.413968 -0.406215 -0.182001 -0.074219 -0.079357 -0.192351 -0.189382 -0.180453 -0.015023 -0.027511 -0.095022 -0.007534 -0.009487
polarizability: 4.65765896e+02 7.43932159e+00 2.23719209e+02 3.96583631e-03 1.79561487e-02 8.44375346e+01
1716.lowfreq: -0.0022 -0.0014 -0.0013 4.1844 7.6106 12.8834 35.6152 43.4702 66.5162
frequency: 35.6045 43.4407 66.5161 100.1604 132.1666 164.2887 190.1178 197.0594 198.3606 229.7358 255.2224 313.1803 333.4996 395.3303 416.5275 436.3210 469.9054 478.3849 482.2902 494.9500 520.9119 541.7575 550.2246 554.3821 579.6387 614.6901 654.4746 686.0806 699.8670 703.3675 738.3408 759.3103 772.7752 802.9696 816.8236 847.9392 848.9431 851.6446 868.0146 880.8960 909.2770 948.0738 959.7447 975.4434 975.8237 983.6881 986.5814 1017.8719 1048.8762 1049.5517 1059.5368 1083.1687 1129.3781 1151.2469 1172.1953 1175.9683 1195.9695 1238.1061 1252.9816 1255.4059 1271.9312 1298.5055 1317.6514 1353.6659 1391.7007 1398.9241 1404.4778 1422.1192 1429.1442 1440.1838 1453.5677 1456.4947 1473.6409 1493.8805 1543.1832 1559.6819 1574.6359 1594.9526 1601.4454 1617.5327 2985.3393 3067.3948 3088.0754 3119.1279 3126.0614 3128.6441 3129.4098 3134.7781 3147.9920 3155.1215 3163.6372 3164.2353 3170.6628
redmass: 6.0339 4.5096 5.5460 4.3275 1.0642 4.7655 4.5166 4.6181 3.9998 6.5395 4.1378 4.3112 4.3771 5.7770 3.7480 3.1044 4.8536 6.8211 4.3025 7.0316 5.8993 3.2678 6.2441 3.3714 3.4457 7.0197 6.3022 6.8767 3.0991 6.9762 2.4622 1.4618 1.3284 6.4004 3.7540 1.5236 1.4302 5.0343 4.7021 1.5903 1.3975 1.3990 4.1587 2.0974 1.3435 1.3279 1.3833 2.4227 4.2286 1.5685 3.0404 1.7488 1.5239 1.3049 1.0904 1.2158 1.3038 1.9275 2.1277 2.2457 2.2008 4.0942 2.5203 4.8287 4.9403 2.1903 1.6189 2.6435 2.4726 3.0323 1.0457 2.9475 1.3404 3.1298 6.5188 6.8880 6.4308 6.5181 6.6202 6.1380 1.0363 1.0962 1.1010 1.0864 1.0854 1.0910 1.0900 1.0892 1.0953 1.0989 1.0968 1.1003 1.0939
irintensity: 0.2579 0.3738 0.6020 1.3537 0.2353 6.6057 0.0063 1.5359 0.3892 0.8105 3.6718 2.1596 0.0107 1.8042 1.0073 7.7430 3.5191 2.6430 8.0600 2.6424 0.2873 0.5038 4.9157 0.3867 4.8916 2.1674 4.4392 1.8028 0.0251 0.4400 29.7296 49.6182 31.5002 2.3737 11.7405 8.6650 73.0805 5.1508 2.1338 24.8783 2.6288 5.3319 10.5843 0.2709 0.0016 0.0783 1.3443 5.5753 1.5751 8.6721 5.6773 13.8755 4.3526 6.4012 5.5854 7.3621 42.0304 2.2323 1.6443 2.9109 0.4161 22.9595 1.7571 13.0799 10.6601 23.5033 12.8122 7.6508 23.5805 6.5393 13.6667 7.2119 7.4094 34.2395 72.2812 44.9163 2.0865 59.8987 3.0336 5.8822 23.1592 12.2911 28.5100 2.7735 0.8932 7.2906 25.4922 1.9918 24.2880 51.0764 11.9413 41.7832 11.4655
temp: 298.150 k
press: 1.00000 atm
elementType: 16 7 6 6 6 6 6 6 6 6 6 6 6 6 6 6 6 6 6 6 1 1 1 1 1 1 1 1 1 1 1 1 1
symmnumber: 1
zpe: 663764.8 jmol-1
zpe.correction: 0.252815 hartree
zpe.thermalcorrener: 0.268548 hartree
zpe.thermalcorrenthalpy: 0.269492 hartree
zpe.thermalcorrgfe: 0.209148 hartree
zpe.sumelectzpe: -1145.204496 hartree
zpe.sumelectthermal: -1145.188763 hartree
zpe.sumelectthermalent: -1145.187818 hartree
zpe.sumelectthermalfe: -1145.248163 hartree
dipole: 0.6665 -1.9598 0.0025
dipole: 2.0701
quadrupole: -99.1319 -106.1701 -131.4403
quadrupole: -0.8599 0.0075 0.0045
quadrupole: 13.1156 6.0773 -19.1929 -0.8599 0.0075 0.0045
hfenergy: -1145.4573106 hartree
pointgroup: C01 [X(C18H13N1S1)]
dipole: 0.2576352 0.7725995 -0.0009895 debye
polarizability: 465.8413844|-6.0031525|223.6393014|-1.2680879|0.1889845|84.4419537 unknown
InChI: InChI=1S/C18H13NS/c1-12-5-4-7-13-9-10-15(19-18(12)13)17-11-14-6-2-3-8-16(14)20-17/h2-11H,1H3
charge 0 multiplicity 1
33 atoms
S  -1.559878 -1.382827 0.055454
N  1.246887 -0.462588 0.047747
C  2.618573 -0.27501 0.043351
C  -1.009989 0.353602 0.055893
C  0.430948 0.618983 0.051414
C  3.210439 1.047172 0.04244
C  -3.375235 0.609825 0.06393
C  3.466111 -1.446322 0.039392
C  -3.279244 -0.823055 0.06173
C  -2.074538 1.244964 0.060528
C  0.941624 1.969253 0.050875
C  2.317132 2.17101 0.046448
C  4.633928 1.188789 0.037528
C  4.854713 -1.256302 0.034706
C  -4.662528 1.216605 0.068917
C  5.441684 0.050187 0.033696
C  -4.430766 -1.639216 0.064375
C  2.843152 -2.823586 0.039753
C  -5.811099 0.404558 0.071572
C  -5.696495 -1.015446 0.069299
H  -1.956194 2.331594 0.061543
H  0.250208 2.816406 0.053889
H  2.734598 3.184893 0.045916
H  5.073043 2.193834 0.036815
H  5.5137 -2.132783 0.031751
H  -4.750229 2.309144 0.070646
H  6.533332 0.144934 0.029983
H  -4.349328 -2.73162 0.062659
H  2.194934 -2.965016 -0.844031
H  2.186633 -2.96104 0.917816
H  3.616986 -3.610956 0.04472
H  -6.80584 0.863611 0.075431
H  -6.602462 -1.631796 0.071412
