program: Gaussian 09
title: 000251362
version: EM64L-G09RevD.01
frameworkgroup: C1[X(C18H13NS)]
method: RPBEPBE
basis: SDD
operation: Freq
keyword: #p
keyword: freq=noraman
keyword: PBEPBE/SDD
title: #p freq=noraman PBEPBE/SDD
converged: YES YES NO NO
title: Mulliken charges:
elementType: S N C C C C C C C C C C C C C C C C C C H H H H H H H H H H H H H
charge: 0.287974 -0.060029 -0.215815 0.208004 0.439583 -0.073977 0.602508 -0.405817 -0.431475 -0.299674 -0.323986 -0.531420 0.463355 -0.405125 -0.370726 -0.420905 -0.272272 -0.234864 -0.239378 -0.808731 0.247681 0.227557 0.244235 0.271520 0.234171 0.232216 0.240066 0.244625 0.227077 0.228953 0.231006 0.232671 0.230993
chargesum: 0.00000
title: Mulliken charges with hydrogens summed into heavy atoms:
elementType: S N C C C C C C C C C C C C C C C C C C
charge: 0.287974 -0.060029 -0.215815 0.208004 0.439583 -0.073977 0.602508 -0.405817 -0.183794 -0.072117 -0.079751 -0.259901 0.463355 -0.170953 -0.138510 -0.180840 -0.027647 -0.007787 -0.010425 -0.114061
polarizability: 4.83595603e+02 9.86130103e+00 2.20169549e+02 1.78355373e-02 2.43305601e-02 8.51453166e+01
1716.lowfreq: -0.0013 -0.0005 0.0007 1.7028 2.9274 5.7028 32.1014 46.9354 63.8274
frequency: 32.0150 46.9285 63.8264 77.2334 111.5443 121.6824 193.0576 203.1921 228.5034 230.0932 270.7215 309.5848 326.7907 381.1225 412.6969 434.5277 437.8196 470.3157 478.2635 479.8567 499.7801 523.7288 560.9762 601.5280 610.2104 616.6993 658.5531 685.5509 688.5715 722.8710 737.5022 758.5052 760.8437 794.9082 808.4730 837.1735 847.9964 854.5129 880.4920 890.0436 908.8585 935.4677 947.3022 965.0396 971.5290 981.9844 983.2336 1012.9702 1019.4321 1046.6565 1050.4069 1120.0164 1128.9292 1161.0059 1171.7947 1182.1728 1196.1642 1236.6666 1249.1919 1255.6773 1276.4396 1300.0724 1315.0130 1361.9279 1391.4351 1398.1115 1399.2234 1414.0079 1431.4714 1445.8409 1458.8806 1468.8817 1471.5564 1509.5894 1538.2979 1550.0130 1578.4365 1592.7916 1603.0914 1633.8182 2977.0648 3053.6705 3092.2511 3115.0776 3127.2103 3129.4064 3136.8207 3139.5223 3150.2383 3150.9661 3163.7273 3166.1728 3170.9860
redmass: 5.7909 4.4190 5.6220 1.0976 5.1269 3.3014 5.0261 5.0212 6.5007 5.3772 3.6358 3.9389 4.9299 5.2409 3.3451 5.3807 3.0629 5.8179 3.0211 6.9688 4.6516 6.9711 3.1870 3.7080 6.7441 8.2115 6.3775 7.0654 2.6841 5.4691 2.4597 1.4594 5.8554 1.9634 2.0864 5.8998 1.3775 1.5430 1.5902 4.4267 1.5124 3.9112 1.4003 1.3256 2.7542 1.3815 1.3287 1.7266 2.2990 4.3462 1.5647 1.7736 1.5222 1.2560 1.0887 1.7754 1.2855 1.9117 2.0115 1.7758 2.5599 3.2708 2.5195 4.8248 4.0590 2.0775 1.8960 3.4486 2.5971 2.9913 3.0567 1.0456 1.2192 3.5114 6.5890 6.1195 6.5957 6.5134 6.7091 6.6717 1.0377 1.0973 1.0985 1.0866 1.0857 1.0893 1.0891 1.0973 1.0951 1.0927 1.0965 1.1004 1.0937
irintensity: 0.4988 1.2505 0.7750 0.5808 0.0003 3.8131 0.2626 1.1259 0.8454 0.3720 0.0042 2.5608 1.1910 1.2491 2.7047 2.0535 7.0707 0.1977 15.0594 0.4493 4.2870 7.8459 6.7980 1.2373 1.2335 4.5896 4.6185 0.4175 0.7368 1.3837 28.7345 48.1733 2.4073 7.1857 2.7214 1.3632 9.0432 82.6807 27.9821 6.4271 6.1900 1.8333 5.2775 0.9407 3.6872 1.9046 0.0105 27.7220 0.2705 1.9189 13.2722 11.5197 3.7151 2.5458 5.9499 2.6255 54.5084 0.2858 3.8721 4.4036 6.2933 15.8933 4.3612 28.7246 6.4602 13.7763 2.3654 10.6461 3.2925 8.8005 11.8873 14.0192 8.2001 56.1206 54.3780 45.1218 21.8748 88.1166 1.6345 46.1273 39.8118 19.7737 15.1890 3.9161 1.0408 8.1273 2.8180 43.6119 23.8369 7.1500 8.7030 47.3811 10.9429
temp: 298.150 k
press: 1.00000 atm
elementType: 16 7 6 6 6 6 6 6 6 6 6 6 6 6 6 6 6 6 6 6 1 1 1 1 1 1 1 1 1 1 1 1 1
symmnumber: 1
zpe: 663240.8 jmol-1
zpe.correction: 0.252615 hartree
zpe.thermalcorrener: 0.268494 hartree
zpe.thermalcorrenthalpy: 0.269439 hartree
zpe.thermalcorrgfe: 0.208389 hartree
zpe.sumelectzpe: -1145.204193 hartree
zpe.sumelectthermal: -1145.188314 hartree
zpe.sumelectthermalent: -1145.187370 hartree
zpe.sumelectthermalfe: -1145.248419 hartree
dipole: -1.4987 2.0609 0.0022
dipole: 2.5482
quadrupole: -93.1034 -106.4078 -131.4163
quadrupole: 0.4934 0.0006 0.0030
quadrupole: 17.2057 3.9014 -21.1071 0.4934 0.0006 0.0030
hfenergy: -1145.4568082 hartree
pointgroup: C01 [X(C18H13N1S1)]
dipole: 0.5914551 0.8094159 -0.0116448 debye
polarizability: 483.5457894|-10.4695659|220.1992927|-1.1319436|-1.4776532|85.1653868 unknown
InChI: InChI=1S/C18H13NS/c1-12-6-7-13-8-9-15(19-16(13)10-12)18-11-14-4-2-3-5-17(14)20-18/h2-11H,1H3
charge 0 multiplicity 1
33 atoms
S  -1.678609 -1.440577 0.073011
N  1.099709 -0.450763 0.052329
C  -1.174793 0.313916 0.051133
C  0.257929 0.614212 0.043516
C  3.025463 1.114125 0.028351
C  2.465283 -0.221795 0.045005
C  -3.545314 0.508454 0.055009
C  -3.4161 -0.920412 0.071457
C  -2.262832 1.17481 0.043947
C  0.736045 1.975588 0.027222
C  2.10672 2.214967 0.019788
C  3.346012 -1.350302 0.054143
C  4.73695 -1.187627 0.047102
C  4.447087 1.266816 0.021351
C  5.278422 0.145603 0.030439
C  -4.8476 1.082147 0.051499
C  -4.544353 -1.765401 0.084254
C  -5.975419 0.242545 0.064177
C  -5.825767 -1.17325 0.080509
C  5.677344 -2.378581 0.056533
H  -2.166107 2.263486 0.030941
H  0.024999 2.806205 0.020936
H  2.49391 3.240552 0.007417
H  2.888689 -2.345036 0.066751
H  4.876155 2.276165 0.008663
H  6.368089 0.272826 0.024895
H  -4.962946 2.172002 0.03898
H  -4.435243 -2.854917 0.096756
H  -6.980482 0.678083 0.061552
H  -6.715233 -1.812742 0.090265
H  6.338712 -2.35756 0.943486
H  5.123405 -3.331948 0.068726
H  6.332379 -2.376588 -0.835346
