program: Gaussian 09
title: 000251372
version: EM64L-G09RevD.01
frameworkgroup: C1[X(C14H13I2N3)]
method: RPBEPBE
basis: SDD
operation: Freq
keyword: #p
keyword: freq=noraman
keyword: PBEPBE/SDD
title: #p freq=noraman PBEPBE/SDD
converged: YES YES NO NO
title: Mulliken charges:
elementType: I I N N N C C C C C C C C C C C C C C H H H H H H H H H H H H H
charge: 0.066665 0.070573 -0.154376 -0.003373 -0.021093 -0.377813 -0.378995 0.452839 -0.372234 -0.373987 -0.769353 -0.769241 0.512480 -0.443629 -0.345759 -0.356484 0.270431 -0.249141 -0.254362 0.260690 0.259563 0.259489 0.261865 0.242241 0.243855 0.296432 0.315399 0.294722 0.316875 0.235717 0.258427 0.251577
chargesum: 0.00000
title: Mulliken charges with hydrogens summed into heavy atoms:
elementType: I I N N N C C C C C C C C C C C C C C
charge: 0.066665 0.070573 -0.154376 -0.003373 -0.021093 0.142439 0.142360 0.452839 -0.129993 -0.130132 -0.157523 -0.157644 0.512480 -0.207913 -0.087332 -0.104907 0.270431 -0.249141 -0.254362
polarizability: 4.59836734e+02 1.51836430e+01 2.65562311e+02 -6.84684766e+00 2.99637604e+01 1.04542785e+02
1716.lowfreq: -4.7990 -3.6586 -0.0003 -0.0003 -0.0003 3.7003 17.4083 20.6784 24.0039
frequency: 17.2681 20.6761 23.9811 27.1315 64.0479 70.3883 85.5226 106.1246 108.7875 126.5834 142.1542 156.4125 173.8861 194.8283 200.2429 246.9534 278.9470 326.0189 345.4190 388.9524 414.8322 425.8160 459.9717 464.6655 484.6156 536.7422 537.1994 592.4000 597.7479 626.9107 645.1008 646.9726 730.1395 742.8321 751.7298 756.9594 778.0992 810.9068 831.6931 854.7353 923.9413 936.3509 943.0067 970.0309 974.4800 988.2517 1001.7374 1022.2631 1026.6352 1101.8778 1138.5785 1164.7617 1182.3114 1199.1513 1201.7467 1209.9711 1221.6252 1262.2749 1277.8631 1290.8921 1332.9538 1340.4413 1344.1004 1357.5116 1390.5558 1398.7661 1449.2900 1450.7674 1456.6770 1485.5139 1503.0381 1514.3230 1544.6881 1579.6598 1625.8950 2156.0873 2169.5609 3020.9563 3025.4735 3062.0458 3062.7250 3076.8030 3081.7269 3111.4532 3127.2449 3147.2404 3148.1105 3158.0220 3165.2878 3184.7924
redmass: 19.4997 13.2757 11.0042 10.0794 5.7902 3.4240 9.1203 2.9064 18.3954 3.6304 5.7051 6.1306 7.8820 4.1191 4.0606 6.5872 4.5670 3.9183 4.7919 4.9654 3.8422 4.1432 4.0311 6.8449 4.5519 2.7039 4.6441 4.9971 9.9860 6.7035 4.9059 6.1481 4.0202 3.6184 1.1582 1.1801 6.3294 1.2816 1.6190 5.6964 2.0507 1.3576 1.3034 1.4494 1.3625 2.4711 1.9045 4.9493 4.3071 1.8214 2.3667 2.1355 1.6325 1.1614 1.1773 1.8683 1.2204 2.0844 1.3187 1.1679 1.5721 1.2532 1.2952 2.2502 2.1869 2.0065 1.2930 1.1142 2.3420 1.1264 1.1739 2.4196 5.6349 5.8114 6.1442 12.6170 12.6325 1.0605 1.0608 1.0567 1.0569 1.1038 1.1044 1.0891 1.0892 1.1105 1.1107 1.0883 1.0938 1.0951
irintensity: 0.1607 1.9432 2.1065 0.5592 0.0429 0.2306 1.0758 1.7350 0.6470 2.4609 4.1769 4.8640 1.5536 3.3379 2.9615 0.5687 0.3574 3.8183 4.6428 9.6552 1.8310 2.3361 0.1882 0.3566 34.2594 22.0600 15.3288 68.4294 4.2587 14.2226 49.8734 6.3415 0.7211 3.7167 6.2914 14.3817 0.5635 5.0547 55.4971 1.2179 24.0830 11.8655 1.4544 10.0860 0.7832 9.6068 6.0603 5.0028 8.4535 83.1978 1.5325 2.2739 162.6479 60.4572 41.1079 40.1833 122.1729 13.9307 87.7307 6.3086 13.8588 14.1122 98.9431 7.1623 32.4440 234.5765 20.8741 16.5371 33.9851 24.7985 19.3818 472.3348 3.7936 420.3481 548.3655 17.7278 146.0140 19.1078 17.2574 6.6834 11.9543 6.3153 4.3972 5.8614 9.4389 3.0055 4.7154 12.0755 21.5003 7.4162
temp: 298.150 k
press: 1.00000 atm
elementType: 53 53 7 7 7 6 6 6 6 6 6 6 6 6 6 6 6 6 6 1 1 1 1 1 1 1 1 1 1 1 1 1
symmnumber: 1
zpe: 623875.6 jmol-1
zpe.correction: 0.237622 hartree
zpe.thermalcorrener: 0.257342 hartree
zpe.thermalcorrenthalpy: 0.258286 hartree
zpe.thermalcorrgfe: 0.182621 hartree
zpe.sumelectzpe: -727.150816 hartree
zpe.sumelectthermal: -727.131096 hartree
zpe.sumelectthermalent: -727.130152 hartree
zpe.sumelectthermalfe: -727.205816 hartree
dipole: 8.4379 -1.2759 -0.7331
dipole: 8.5652
quadrupole: -223.8951 -152.4114 -142.2864
quadrupole: 0.4867 2.7455 1.0175
quadrupole: -51.0308 20.4529 30.5779 0.4867 2.7455 1.0175
hfenergy: -727.3884378 hartree
pointgroup: C01 [X(C14H13I2N3)]
dipole: 3.192781 -1.005972 -0.387012 debye
polarizability: 458.9511186|-13.1150233|268.6115853|-19.5023239|20.956718|102.3791258 unknown
InChI: InChI=1S/C14H13I2N3/c15-5-7-19(8-6-16)14-3-1-12(2-4-14)9-13(10-17)11-18/h1-4,9H,5-8H2
charge 0 multiplicity 1
32 atoms
I  5.224107 -3.722293 0.190984
I  4.448315 4.09183 -0.364785
N  2.721799 -0.019636 -0.006508
N  -6.506703 -0.834813 0.259252
N  -3.87507 2.697195 0.952081
C  3.605664 -1.136418 -0.404442
C  3.381348 1.259087 0.337177
C  1.32912 -0.166871 0.036358
C  0.704182 -1.429464 -0.228886
C  0.470838 0.940626 0.346201
C  3.938602 -2.027861 0.809361
C  3.44007 2.191937 -0.889688
C  -1.549698 -0.458129 0.114573
C  -0.687397 -1.558191 -0.191236
C  -0.919324 0.798244 0.385587
C  -2.976813 -0.711346 0.123179
C  -4.057008 0.134574 0.369704
C  -5.395863 -0.390674 0.310439
C  -3.948017 1.531309 0.686753
H  4.538363 -0.718417 -0.82192
H  3.140211 -1.731489 -1.208854
H  4.406628 1.044123 0.685749
H  2.862137 1.752209 1.176664
H  1.303516 -2.314921 -0.457087
H  0.890778 1.929146 0.551795
H  4.515284 -1.491778 1.57815
H  3.045384 -2.487626 1.25666
H  4.035011 1.765585 -1.711534
H  2.442999 2.480704 -1.253061
H  -1.131527 -2.53956 -0.39873
H  -1.521701 1.677964 0.624681
H  -3.260036 -1.748645 -0.105016
