program: Gaussian 09
title: 000251374
version: EM64L-G09RevD.01
frameworkgroup: C1[X(C15H15I2N3)]
method: RPBEPBE
basis: SDD
operation: Freq
keyword: #p
keyword: freq=noraman
keyword: PBEPBE/SDD
title: #p freq=noraman PBEPBE/SDD
converged: NO YES NO NO
title: Mulliken charges:
elementType: I I N N N C C C C C C C C C C C C C C C H H H H H H H H H H H H H H H
charge: 0.064671 0.065906 -0.172149 0.000070 -0.019281 0.459201 -0.354764 -0.362452 -0.523042 0.324272 -0.384253 0.342087 -0.419705 -0.773468 -0.774014 -0.839807 -0.349777 0.258774 -0.260829 -0.237182 0.249267 0.258921 0.263830 0.250952 0.243707 0.245219 0.239841 0.290642 0.315680 0.314599 0.290417 0.232052 0.276630 0.238330 0.245654
chargesum: 0.00000
title: Mulliken charges with hydrogens summed into heavy atoms:
elementType: I I N N N C C C C C C C C C C C C C C C
charge: 0.064671 0.065906 -0.172149 0.000070 -0.019281 0.459201 0.153425 0.152329 -0.279336 0.324272 -0.139034 0.342087 -0.179865 -0.167146 -0.168998 -0.092794 -0.104124 0.258774 -0.260829 -0.237182
polarizability: 4.50500285e+02 -1.11748228e+01 2.78877010e+02 -1.62548015e+01 1.54949068e+01 1.22761081e+02
1716.lowfreq: -3.1420 -2.7850 -0.0007 -0.0006 -0.0004 3.1484 18.4642 20.7495 21.5765
frequency: 18.4604 20.7372 21.5512 25.2751 43.4690 58.0068 86.4687 102.8232 117.3609 122.7230 137.6212 149.6979 176.8328 190.8201 204.7702 215.5004 226.6082 251.5918 262.5161 299.6198 340.0047 374.2133 393.5689 415.1877 447.3323 462.2659 474.2425 515.5696 542.3433 554.0252 588.9335 598.2367 611.9674 615.3629 635.2332 704.2017 722.4356 746.5035 756.0990 768.2838 810.5669 818.4190 865.0829 891.4614 916.6620 937.6559 939.4440 956.6421 992.6533 1017.9373 1028.8758 1041.8090 1045.7886 1105.4828 1121.8961 1161.3374 1182.3984 1197.3869 1204.5359 1210.0769 1221.9983 1241.6016 1282.0198 1295.8438 1306.0836 1340.8148 1345.5959 1359.8309 1380.7401 1401.3558 1404.0455 1434.0141 1446.9167 1455.8992 1470.2057 1479.2024 1483.9936 1496.7745 1507.0586 1537.7715 1574.9983 1620.8334 2159.9688 2170.7770 2990.6878 3014.0181 3017.7725 3060.5263 3064.8918 3072.8826 3074.1256 3078.7584 3094.7695 3097.5314 3127.7885 3145.3580 3149.3952 3150.0885 3170.1841
redmass: 8.4097 12.3926 9.9397 9.3859 7.6485 6.4974 3.0647 3.2082 11.0692 5.0475 7.0448 5.4326 5.0879 3.7682 3.5517 4.3890 1.1352 5.5161 3.4567 4.0359 4.1064 4.3389 5.0982 4.1450 3.6494 5.2881 4.4039 4.2334 4.4624 5.8946 3.5589 12.0214 3.9020 4.2116 6.4776 4.7413 3.3946 1.1666 1.2349 3.3286 1.6321 3.9323 1.4550 4.7553 1.4865 1.3905 1.7215 1.3897 1.5092 4.4988 3.0879 2.1035 1.6026 1.6934 2.7881 2.4261 1.8249 1.1607 1.2120 2.1415 1.5179 2.7053 1.4669 1.2146 1.4221 1.2630 1.3179 2.1088 1.8472 2.4242 1.2302 2.5091 1.1211 1.0958 1.1376 1.0786 1.1990 1.1006 2.6883 6.0069 6.1434 6.1031 12.6118 12.6254 1.0372 1.0613 1.0613 1.0566 1.0562 1.1033 1.0974 1.1029 1.0990 1.0886 1.0892 1.1095 1.0925 1.1089 1.0940
irintensity: 0.1220 0.6682 1.3530 2.1042 1.7755 0.4497 0.1756 2.7985 1.0761 4.4971 3.3469 2.0692 1.1161 3.5550 1.0581 4.3542 0.0860 3.6804 2.4980 0.3196 23.5433 8.9615 11.5976 3.3869 13.9445 3.0072 15.3276 21.2113 14.4608 1.2624 12.0082 1.4267 48.0900 74.5838 20.2378 4.3375 10.6651 4.6908 11.8351 10.1453 27.4279 9.1393 25.8941 13.3095 46.5372 8.2283 6.9795 9.5650 6.1721 1.2674 6.6408 25.2762 5.6980 77.0939 23.7137 96.6882 20.3023 43.5660 21.2404 27.6661 22.3223 85.4633 101.0513 7.7007 1.5330 42.1827 104.0094 2.8396 2.6192 211.8932 16.4916 47.4751 3.1743 30.2301 20.0428 12.8699 27.7333 38.2855 225.2302 127.6260 397.4817 571.5454 14.1364 133.4945 11.2339 15.1204 32.2372 10.7382 13.6551 4.7207 9.0088 12.3816 11.3270 5.3787 8.3408 5.2787 23.6544 4.1806 19.2130
temp: 298.150 k
press: 1.00000 atm
elementType: 53 53 7 7 7 6 6 6 6 6 6 6 6 6 6 6 6 6 6 6 1 1 1 1 1 1 1 1 1 1 1 1 1 1 1
symmnumber: 1
zpe: 694861.1 jmol-1
zpe.correction: 0.264659 hartree
zpe.thermalcorrener: 0.285959 hartree
zpe.thermalcorrenthalpy: 0.286903 hartree
zpe.thermalcorrgfe: 0.207999 hartree
zpe.sumelectzpe: -766.370534 hartree
zpe.sumelectthermal: -766.349234 hartree
zpe.sumelectthermalent: -766.348290 hartree
zpe.sumelectthermalfe: -766.427193 hartree
dipole: -7.6823 -0.3307 -0.8071
dipole: 7.7316
quadrupole: -225.8355 -154.9285 -152.9262
quadrupole: 4.4524 -7.9893 -4.1433
quadrupole: -47.9387 22.9682 24.9705 4.4524 -7.9893 -4.1433
hfenergy: -766.6351923 hartree
pointgroup: C01[X(C15H15I2N3)]
dipole: 2.9735565 0.4894091 -0.4138719 debye
polarizability: 450.4224596|15.3020249|271.0785215|14.5106902|-36.959718|130.6373956 unknown
InChI: InChI=1S/C15H15I2N3/c1-12-8-15(20(6-4-16)7-5-17)3-2-14(12)9-13(10-18)11-19/h2-3,8-9H,4-7H2,1H3
charge 0 multiplicity 1
35 atoms
I  5.177315 3.689389 -0.794693
I  4.688213 -3.844714 0.292762
N  2.737125 0.181083 0.553275
N  -6.361944 0.702699 -1.086645
N  -4.069379 -1.8115 1.786563
C  1.380281 0.227313 0.191618
C  3.562507 1.407302 0.564739
C  3.384754 -1.094536 0.924422
C  0.581875 -0.955863 0.140559
C  -0.798783 -0.945375 -0.144687
C  0.745997 1.461267 -0.164868
C  -1.444663 0.314911 -0.411053
C  -0.615445 1.481892 -0.470129
C  4.075497 1.767688 -0.845489
C  3.852625 -1.884277 -0.316152
C  -1.500632 -2.285731 -0.266666
C  -2.85701 0.541621 -0.684864
C  -4.004811 -0.075353 -0.191875
C  -5.295244 0.347398 -0.675009
C  -4.029008 -1.041221 0.87056
H  4.422678 1.246103 1.237061
H  2.985663 2.249272 0.987803
H  2.692986 -1.707921 1.528713
H  4.254903 -0.875289 1.567198
H  1.042335 -1.934303 0.308353
H  1.306034 2.399061 -0.204526
H  -1.078633 2.44132 -0.730169
H  4.796746 1.033672 -1.234508
H  3.260518 1.919208 -1.568289
H  3.029207 -2.121298 -1.005929
H  4.668663 -1.38163 -0.856616
H  -0.798614 -3.050001 -0.643435
H  -1.885737 -2.639205 0.706615
H  -2.359741 -2.242824 -0.956536
H  -3.062375 1.392842 -1.351001
