program: Gaussian 09
title: 000251404
version: EM64L-G09RevD.01
frameworkgroup: C1[X(C22H34O3)]
method: RPBEPBE
basis: SDD
operation: Freq
keyword: #pfreq=noraman
keyword: PBEPBE/SDD
title: #p freq=noraman PBEPBE/SDD
converged: YES YES NO NO
title: Mulliken charges:
elementType: O O O C C C C C C C C C C C C C C C C C C C C C C H H H H H H H H H H H H H H H H H H H H H H H H H H H H H H H H H H
charge: -0.211662 -0.444816 -0.209898 0.405862 -0.124474 -0.129549 -0.117696 0.416178 -0.238313 -0.532595 -0.600461 -0.105379 -0.540953 -0.022260 -0.509211 -0.501018 -0.250691 -0.530673 -0.838092 -0.512268 -0.867607 -0.470418 -0.059691 0.170585 -0.731353 0.209985 0.239108 0.186763 0.248591 0.198093 0.208880 0.257204 0.231174 0.238732 0.223852 0.216633 0.185421 0.217062 0.198112 0.198664 0.212387 0.249795 0.206027 0.212862 0.234202 0.252274 0.214810 0.210487 0.219432 0.219583 0.231125 0.224384 0.225931 0.182600 0.179499 0.246820 0.224410 0.221876 0.329679
chargesum: 0.00000
title: Mulliken charges with hydrogens summed into heavy atoms:
elementType: O O O C C C C C C C C C C C C C C C C C C C C C C
charge: -0.211662 -0.115138 -0.209898 0.405862 0.085511 0.109559 0.069066 0.416178 0.010278 -0.125622 -0.112084 0.133353 -0.100468 0.163161 -0.094036 -0.089967 -0.000897 -0.111785 -0.136808 -0.082349 -0.192515 -0.061887 0.119808 0.170585 -0.038247
polarizability: 2.95465520e+02 4.11471438e+00 2.11752412e+02 -5.01197396e+00 -6.45627476e-01 1.86522508e+02
1716.lowfreq: -2.9297 -0.0004 -0.0003 0.0007 3.8268 15.4894 30.9013 50.4765 62.0325
frequency: 30.8769 50.3072 62.0300 81.3571 90.7477 118.8558 134.5994 155.1366 165.7625 174.5786 188.6997 218.8038 225.2506 231.7797 241.4255 251.8542 260.1902 278.9503 288.8438 293.5821 308.0505 311.0561 327.8992 335.8323 344.0183 374.5264 382.6834 399.4053 419.7318 431.2223 457.1307 458.8877 480.4471 485.5361 517.9651 525.9856 535.6304 562.1756 570.4451 618.8908 624.5341 650.9758 667.2449 698.9778 724.6343 762.9865 778.9727 795.4269 803.0532 825.6711 835.1895 846.7145 856.9539 888.9770 903.5557 916.6335 930.4833 940.3074 947.6208 954.3028 966.6416 975.2488 990.6255 994.7913 999.7670 1004.0832 1011.8810 1015.4192 1021.3804 1037.6529 1042.5530 1054.8134 1068.9039 1078.3297 1079.7646 1087.1097 1094.3020 1106.0414 1117.1529 1121.7911 1125.1203 1129.9670 1132.6813 1151.5640 1155.1571 1164.4174 1179.6196 1185.9418 1199.1002 1210.4219 1220.1955 1225.3091 1233.8555 1242.6178 1244.6860 1255.5754 1261.8100 1267.0561 1276.9443 1279.9276 1285.9998 1294.6647 1296.5122 1301.5093 1307.6501 1313.2921 1317.3711 1321.8329 1325.1375 1327.7462 1333.3994 1339.6212 1345.2483 1349.3251 1354.1236 1357.7268 1363.0754 1375.9792 1392.1727 1393.0363 1396.1373 1404.0964 1458.7324 1460.6257 1461.7880 1464.4793 1466.5394 1468.5833 1473.0440 1474.3735 1480.8921 1482.9732 1491.1918 1492.9742 1496.6152 1503.7143 1693.4333 2899.0108 2903.9908 2908.9210 2915.1834 2945.4717 2950.9028 2951.5645 2970.7425 2972.0878 2973.4235 2983.4592 2985.2752 2991.0032 2992.3554 2994.4137 3002.6238 3012.8476 3013.6941 3018.2600 3023.6233 3028.3114 3034.5936 3037.1322 3038.8332 3044.3917 3049.3520 3075.2510 3076.2099 3080.1039 3080.6575 3087.3978 3090.8399 3093.2904 3550.9213
redmass: 5.4976 3.9723 4.3556 3.8009 4.1463 4.4478 1.5605 2.3226 3.5715 2.9418 2.8093 1.2611 2.5689 1.4123 2.3115 2.4083 1.7879 1.9404 2.6767 1.8226 2.0709 2.0336 2.7885 2.6917 2.8749 2.9425 3.6440 2.9526 2.6384 3.5037 1.9716 3.5880 2.7498 3.7816 2.5895 2.5269 3.1219 2.5342 3.7163 2.8180 3.8061 3.6921 4.8616 3.2921 2.6789 3.6271 3.5162 1.8694 2.1130 1.9736 2.5287 3.2775 2.1016 1.5955 1.7853 2.1157 1.8595 1.8711 1.9438 2.1417 2.3493 2.4658 2.0570 2.3345 2.0527 1.8693 2.0512 2.0091 2.0825 1.8741 2.1150 2.2205 2.6732 2.3533 2.2004 2.0038 1.6559 2.0567 1.7561 2.0278 1.9925 1.8613 1.6143 1.8191 1.8972 1.6227 1.6991 2.1613 2.1354 1.7050 1.6434 1.6387 1.6252 1.2904 1.4805 1.4646 1.3316 1.4322 1.4187 1.3511 1.4910 1.5102 1.3474 1.3429 1.3934 1.4170 1.3205 1.2806 1.4359 1.4001 1.3761 1.3782 1.4287 1.4905 1.5316 1.4148 1.4653 1.4624 1.2280 1.3070 1.4826 1.2037 1.0806 1.0822 1.0821 1.0864 1.0887 1.0833 1.0530 1.0788 1.0490 1.0897 1.0604 1.0586 1.0587 1.0548 12.2450 1.0816 1.0803 1.0820 1.0820 1.0645 1.0635 1.0607 1.0658 1.0633 1.0762 1.0355 1.0594 1.0478 1.0443 1.0494 1.0842 1.0859 1.0798 1.0870 1.0963 1.1008 1.0845 1.0890 1.0988 1.0999 1.1015 1.0978 1.0968 1.1010 1.0999 1.0972 1.0986 1.1004 1.0659
irintensity: 1.5267 1.2252 2.4880 1.3815 0.5875 0.3675 0.6534 0.2514 0.6444 0.5648 0.2263 1.5739 3.4513 1.2424 3.0945 0.3585 4.2800 6.2224 0.5697 43.9410 43.3067 38.4623 5.8946 5.5572 5.0788 1.5615 1.6799 0.1823 0.9001 0.8929 1.2911 1.8508 5.5640 3.5016 0.5506 1.0273 4.2288 0.5200 0.1164 0.4113 13.7983 3.3522 4.3988 2.1948 2.2970 6.1394 3.0226 1.9284 0.3046 1.8260 7.2266 43.2025 1.6453 1.7870 15.7525 6.9016 14.0057 14.9577 24.1461 39.6034 6.3341 4.7034 0.8277 49.6736 50.7529 20.9670 40.5924 7.0761 12.9692 3.6420 3.8840 2.2047 12.9488 34.4996 12.1038 5.7491 2.2827 18.4822 0.6588 16.6727 26.8424 4.2396 2.4108 34.8446 5.1069 50.6068 3.6226 1.0293 2.0225 3.3888 3.9690 6.8576 0.7971 5.1461 4.0663 1.5635 8.8212 1.5379 5.1301 8.4399 1.8851 1.2099 5.6421 3.4684 2.5327 1.1488 8.3482 2.0083 1.2351 0.3306 0.4836 2.9351 1.8454 4.6605 3.3758 7.5370 3.8203 4.0109 4.9717 19.4754 9.6263 23.2439 0.9006 0.6241 8.4777 4.5853 27.7835 4.5963 6.8911 6.2749 11.8977 12.6322 1.2230 18.2055 3.4532 7.8643 349.4755 0.5640 16.1388 2.2670 82.2695 26.2132 52.7938 26.5871 36.5109 68.8184 20.2839 25.2602 9.0213 12.5659 25.2256 37.5956 13.8793 31.3300 17.9592 45.5200 31.2479 52.0353 10.9437 23.7484 52.8682 38.2198 88.1614 29.1086 31.1343 27.6164 46.1982 43.4300 19.6428 22.2925 1.9886
temp: 298.150 k
press: 1.00000 atm
elementType: 8 8 8 6 6 6 6 6 6 6 6 6 6 6 6 6 6 6 6 6 6 6 6 6 6 1 1 1 1 1 1 1 1 1 1 1 1 1 1 1 1 1 1 1 1 1 1 1 1 1 1 1 1 1 1 1 1 1 1
symmnumber: 1
zpe: 1366113.5 jmol-1
zpe.correction: 0.520325 hartree
zpe.thermalcorrener: 0.543759 hartree
zpe.thermalcorrenthalpy: 0.544703 hartree
zpe.thermalcorrgfe: 0.470127 hartree
zpe.sumelectzpe: -1082.472859 hartree
zpe.sumelectthermal: -1082.449426 hartree
zpe.sumelectthermalent: -1082.448481 hartree
zpe.sumelectthermalfe: -1082.523057 hartree
dipole: 3.3516 -3.0621 -3.9981
dipole: 6.0493
quadrupole: -198.2062 -150.5702 -152.3243
quadrupole: -0.8040 12.5454 -1.4907
quadrupole: -31.1726 16.4634 14.7093 -0.8040 12.5454 -1.4907
hfenergy: -1082.9931842 hartree
pointgroup: C01 [X(C22H34O3)]
dipole: 1.3255136 -1.1730315 -1.5910215 debye
polarizability: 295.4974563|4.2605738|211.772881|-4.5053351|-0.1388446|186.4701027 unknown
InChI: InChI=1S/C22H34O3/c1-12-19-18(25-20(12)24)11-17-15-5-4-13-10-14(23)6-8-21(13,2)16(15)7-9-22(17,19)3/h12-19,23H,4-11H2,1-3H3
charge 0 multiplicity 1
59 atoms
O  -4.480825 1.39525 0.280829
O  7.003008 -0.011707 -0.083907
O  -6.07735 0.104886 1.366646
C  -1.834902 -0.584312 -0.033222
C  -1.0516 0.687398 -0.501583
C  0.3556 0.813796 0.114162
C  1.184638 -0.457672 -0.282325
C  2.664191 -0.405894 0.264967
C  -3.181446 -0.367912 -0.808327
C  -1.022691 -1.82459 -0.477804
C  -2.074028 1.840998 -0.330775
C  -3.413203 1.184515 -0.75121
C  0.431816 -1.775038 0.068254
C  3.317622 0.917639 -0.282243
C  1.06842 2.109325 -0.345062
C  2.531989 2.178434 0.141988
C  -4.487429 -0.971343 -0.245571
C  3.486044 -1.602605 -0.314509
C  -2.061268 -0.609332 1.503581
C  4.825248 1.024205 0.049693
C  2.689205 -0.469903 1.817499
C  5.002239 -1.509533 -0.01055
C  5.598066 -0.177761 -0.508212
C  -5.124663 0.16956 0.572779
C  -5.4862 -1.442974 -1.335211
H  -0.89911 0.561312 -1.600431
H  0.256716 0.855205 1.218707
H  1.272503 -0.425627 -1.395382
H  -3.028271 -0.682767 -1.858371
H  -0.991666 -1.855887 -1.587675
H  -1.511433 -2.761816 -0.142527
H  -2.144337 2.17567 0.720273
H  -1.836827 2.724711 -0.946341
H  -3.818768 1.596862 -1.69156
H  0.413822 -1.917643 1.165596
H  0.986463 -2.637959 -0.345692
H  3.237356 0.853315 -1.393484
H  0.506049 2.993729 0.012938
H  1.054898 2.15053 -1.456091
H  3.025836 3.077445 -0.277689
H  2.562373 2.293089 1.244273
H  -4.303581 -1.814478 0.44341
H  3.335604 -1.635667 -1.415398
H  3.104087 -2.560436 0.086592
H  -1.106786 -0.612731 2.055169
H  -2.64215 0.258687 1.859804
H  -2.606075 -1.523036 1.804297
H  5.240714 1.954018 -0.383726
H  4.996238 1.080707 1.14185
H  2.351094 -1.459762 2.174559
H  3.705514 -0.311403 2.216369
H  2.037466 0.29159 2.279012
H  5.186845 -1.590178 1.077858
H  5.527596 -2.362376 -0.488955
H  5.540031 -0.158071 -1.622074
H  -6.4387 -1.758925 -0.875542
H  -5.706706 -0.635551 -2.057721
H  -5.065466 -2.297834 -1.894039
H  7.52639 -0.790549 -0.403598
